ok  	github.com/google/syzkaller/dashboard/app	(cached)
?   	github.com/google/syzkaller/dashboard/dashapi	[no test files]
?   	github.com/google/syzkaller/executor	[no test files]
ok  	github.com/google/syzkaller/pkg/ast	3.348s
ok  	github.com/google/syzkaller/pkg/bisect	82.890s
ok  	github.com/google/syzkaller/pkg/build	100.656s
ok  	github.com/google/syzkaller/pkg/compiler	7.056s
ok  	github.com/google/syzkaller/pkg/config	(cached)
?   	github.com/google/syzkaller/pkg/cover	[no test files]
ok  	github.com/google/syzkaller/pkg/csource	89.963s
ok  	github.com/google/syzkaller/pkg/db	(cached)
ok  	github.com/google/syzkaller/pkg/email	(cached)
?   	github.com/google/syzkaller/pkg/gce	[no test files]
?   	github.com/google/syzkaller/pkg/gcs	[no test files]
?   	github.com/google/syzkaller/pkg/hash	[no test files]
ok  	github.com/google/syzkaller/pkg/host	92.972s
?   	github.com/google/syzkaller/pkg/html	[no test files]
ok  	github.com/google/syzkaller/pkg/ifuzz	(cached)
?   	github.com/google/syzkaller/pkg/ifuzz/gen	[no test files]
?   	github.com/google/syzkaller/pkg/ifuzz/generated	[no test files]
ok  	github.com/google/syzkaller/pkg/instance	4.077s
--- FAIL: TestExecute (73.34s)
	ipc_test.go:45: seed=1577095578077388230
	ipc_test.go:81: testing flags 0x0
	ipc_test.go:81: testing flags 0x10
	ipc_test.go:104: program hanged:
		signal: killed
FAIL
FAIL	github.com/google/syzkaller/pkg/ipc	81.139s
?   	github.com/google/syzkaller/pkg/ipc/ipcconfig	[no test files]
ok  	github.com/google/syzkaller/pkg/kd	(cached)
ok  	github.com/google/syzkaller/pkg/log	(cached)
ok  	github.com/google/syzkaller/pkg/mgrconfig	4.323s
ok  	github.com/google/syzkaller/pkg/osutil	(cached)
ok  	github.com/google/syzkaller/pkg/report	11.198s
ok  	github.com/google/syzkaller/pkg/repro	6.631s
?   	github.com/google/syzkaller/pkg/rpctype	[no test files]
--- FAIL: Test (1.45s)
    --- FAIL: Test/64 (88.42s)
    	run.go:67: align0  C                             : OK
    	run.go:67: align0 /repeat C                      : BROKEN (non-forking loop)
    	run.go:67: align0 /thr C                         : OK
    	run.go:67: align0 /thr/repeat C                  : BROKEN (non-forking loop)
    	run.go:67: align0 none                           : OK
    	run.go:67: align0 none C                         : OK
    	run.go:67: align0 none/repeat                    : OK
    	run.go:67: align0 none/repeat C                  : BROKEN (non-forking loop)
    	run.go:67: align0 none/thr                       : OK
    	run.go:67: align0 none/thr C                     : OK
    	run.go:67: align0 none/thr/repeat                : OK
    	run.go:67: align0 none/thr/repeat C              : BROKEN (non-forking loop)
    	run.go:67: bf  C                                 : OK
    	run.go:67: bf /repeat C                          : BROKEN (non-forking loop)
    	run.go:67: bf /thr C                             : OK
    	run.go:67: bf /thr/repeat C                      : BROKEN (non-forking loop)
    	run.go:67: bf none                               : OK
    	run.go:67: bf none C                             : OK
    	run.go:67: bf none/repeat                        : OK
    	run.go:67: bf none/repeat C                      : BROKEN (non-forking loop)
    	run.go:67: bf none/thr                           : OK
    	run.go:67: bf none/thr C                         : OK
    	run.go:67: bf none/thr/repeat                    : FAIL: run 1: hanged
    			signal: killed
    			
    	run.go:67: bf none/thr/repeat C                  : BROKEN (non-forking loop)
    	run.go:67: bf2  C                                : OK
    	run.go:67: bf2 /repeat C                         : BROKEN (non-forking loop)
    	run.go:67: bf2 /thr C                            : OK
    	run.go:67: bf2 /thr/repeat C                     : BROKEN (non-forking loop)
    	run.go:67: bf2 none                              : OK
    	run.go:67: bf2 none C                            : OK
    	run.go:67: bf2 none/repeat                       : OK
    	run.go:67: bf2 none/repeat C                     : BROKEN (non-forking loop)
    	run.go:67: bf2 none/thr                          : OK
    	run.go:67: bf2 none/thr C                        : OK
    	run.go:67: bf2 none/thr/repeat                   : OK
    	run.go:67: bf2 none/thr/repeat C                 : BROKEN (non-forking loop)
    	run.go:67: errno  C                              : OK
    	run.go:67: errno /repeat C                       : BROKEN (non-forking loop)
    	run.go:67: errno /thr C                          : OK
    	run.go:67: errno /thr/repeat C                   : BROKEN (non-forking loop)
    	run.go:67: errno none                            : OK
    	run.go:67: errno none C                          : OK
    	run.go:67: errno none/repeat                     : OK
    	run.go:67: errno none/repeat C                   : BROKEN (non-forking loop)
    	run.go:67: errno none/thr                        : OK
    	run.go:67: errno none/thr C                      : OK
    	run.go:67: errno none/thr/repeat                 : OK
    	run.go:67: errno none/thr/repeat C               : BROKEN (non-forking loop)
    	run.go:67: exit0  C                              : OK
    	run.go:67: exit0 /repeat C                       : BROKEN (non-forking loop)
    	run.go:67: exit0 /thr C                          : OK
    	run.go:67: exit0 /thr/repeat C                   : BROKEN (non-forking loop)
    	run.go:67: exit0 none                            : OK
    	run.go:67: exit0 none C                          : OK
    	run.go:67: exit0 none/repeat                     : OK
    	run.go:67: exit0 none/repeat C                   : BROKEN (non-forking loop)
    	run.go:67: exit0 none/thr                        : OK
    	run.go:67: exit0 none/thr C                      : OK
    	run.go:67: exit0 none/thr/repeat                 : OK
    	run.go:67: exit0 none/thr/repeat C               : BROKEN (non-forking loop)
    	run.go:67: exit1  C                              : OK
    	run.go:67: exit1 /repeat C                       : BROKEN (non-forking loop)
    	run.go:67: exit1 /thr C                          : OK
    	run.go:67: exit1 /thr/repeat C                   : BROKEN (non-forking loop)
    	run.go:67: exit1 none                            : OK
    	run.go:67: exit1 none C                          : OK
    	run.go:67: exit1 none/repeat                     : OK
    	run.go:67: exit1 none/repeat C                   : BROKEN (non-forking loop)
    	run.go:67: exit1 none/thr                        : OK
    	run.go:67: exit1 none/thr C                      : OK
    	run.go:67: exit1 none/thr/repeat                 : OK
    	run.go:67: exit1 none/thr/repeat C               : BROKEN (non-forking loop)
    	run.go:67: strings  C                            : OK
    	run.go:67: strings /repeat C                     : BROKEN (non-forking loop)
    	run.go:67: strings /thr C                        : OK
    	run.go:67: strings /thr/repeat C                 : BROKEN (non-forking loop)
    	run.go:67: strings none                          : OK
    	run.go:67: strings none C                        : OK
    	run.go:67: strings none/repeat                   : OK
    	run.go:67: strings none/repeat C                 : BROKEN (non-forking loop)
    	run.go:67: strings none/thr                      : OK
    	run.go:67: strings none/thr C                    : OK
    	run.go:67: strings none/thr/repeat               : OK
    	run.go:67: strings none/thr/repeat C             : BROKEN (non-forking loop)
    	run.go:67: test  C                               : OK
    	run.go:67: test /repeat C                        : BROKEN (non-forking loop)
    	run.go:67: test /thr C                           : OK
    	run.go:67: test /thr/repeat C                    : BROKEN (non-forking loop)
    	run.go:67: test none                             : OK
    	run.go:67: test none C                           : OK
    	run.go:67: test none/repeat                      : OK
    	run.go:67: test none/repeat C                    : BROKEN (non-forking loop)
    	run.go:67: test none/thr                         : OK
    	run.go:67: test none/thr C                       : OK
    	run.go:67: test none/thr/repeat                  : OK
    	run.go:67: test none/thr/repeat C                : BROKEN (non-forking loop)
    	run.go:67: zero_args  C                          : OK
    	run.go:67: zero_args /repeat C                   : BROKEN (non-forking loop)
    	run.go:67: zero_args /thr C                      : OK
    	run.go:67: zero_args /thr/repeat C               : BROKEN (non-forking loop)
    	run.go:67: zero_args none                        : OK
    	run.go:67: zero_args none C                      : OK
    	run.go:67: zero_args none/repeat                 : OK
    	run.go:67: zero_args none/repeat C               : BROKEN (non-forking loop)
    	run.go:67: zero_args none/thr                    : OK
    	run.go:67: zero_args none/thr C                  : OK
    	run.go:67: zero_args none/thr/repeat             : OK
    	run.go:67: zero_args none/thr/repeat C           : BROKEN (non-forking loop)
    	run.go:67: ok: 71, broken: 36, skip: 0, fail: 1
    	run_test.go:87: tests failed
FAIL
FAIL	github.com/google/syzkaller/pkg/runtest	108.191s
ok  	github.com/google/syzkaller/pkg/serializer	(cached)
?   	github.com/google/syzkaller/pkg/signal	[no test files]
ok  	github.com/google/syzkaller/pkg/symbolizer	1.282s
ok  	github.com/google/syzkaller/pkg/vcs	30.045s
ok  	github.com/google/syzkaller/prog	19.163s
ok  	github.com/google/syzkaller/prog/test	4.017s
?   	github.com/google/syzkaller/sys	[no test files]
?   	github.com/google/syzkaller/sys/akaros	[no test files]
?   	github.com/google/syzkaller/sys/akaros/gen	[no test files]
?   	github.com/google/syzkaller/sys/freebsd	[no test files]
?   	github.com/google/syzkaller/sys/freebsd/gen	[no test files]
?   	github.com/google/syzkaller/sys/fuchsia	[no test files]
?   	github.com/google/syzkaller/sys/fuchsia/fidlgen	[no test files]
?   	github.com/google/syzkaller/sys/fuchsia/gen	[no test files]
?   	github.com/google/syzkaller/sys/fuchsia/layout	[no test files]
ok  	github.com/google/syzkaller/sys/linux	1.603s
?   	github.com/google/syzkaller/sys/linux/gen	[no test files]
?   	github.com/google/syzkaller/sys/netbsd	[no test files]
?   	github.com/google/syzkaller/sys/netbsd/gen	[no test files]
ok  	github.com/google/syzkaller/sys/openbsd	1.128s
?   	github.com/google/syzkaller/sys/openbsd/gen	[no test files]
?   	github.com/google/syzkaller/sys/syz-extract	[no test files]
?   	github.com/google/syzkaller/sys/syz-sysgen	[no test files]
?   	github.com/google/syzkaller/sys/targets	[no test files]
?   	github.com/google/syzkaller/sys/test	[no test files]
?   	github.com/google/syzkaller/sys/test/gen	[no test files]
?   	github.com/google/syzkaller/sys/trusty	[no test files]
?   	github.com/google/syzkaller/sys/trusty/gen	[no test files]
?   	github.com/google/syzkaller/sys/windows	[no test files]
?   	github.com/google/syzkaller/sys/windows/gen	[no test files]
ok  	github.com/google/syzkaller/syz-ci	8.713s
ok  	github.com/google/syzkaller/syz-fuzzer	6.584s
ok  	github.com/google/syzkaller/syz-hub	2.557s
ok  	github.com/google/syzkaller/syz-hub/state	(cached)
?   	github.com/google/syzkaller/syz-manager	[no test files]
?   	github.com/google/syzkaller/tools/syz-benchcmp	[no test files]
?   	github.com/google/syzkaller/tools/syz-bisect	[no test files]
?   	github.com/google/syzkaller/tools/syz-check	[no test files]
?   	github.com/google/syzkaller/tools/syz-cover	[no test files]
?   	github.com/google/syzkaller/tools/syz-crush	[no test files]
?   	github.com/google/syzkaller/tools/syz-db	[no test files]
?   	github.com/google/syzkaller/tools/syz-env	[no test files]
?   	github.com/google/syzkaller/tools/syz-execprog	[no test files]
?   	github.com/google/syzkaller/tools/syz-expand	[no test files]
?   	github.com/google/syzkaller/tools/syz-fmt	[no test files]
?   	github.com/google/syzkaller/tools/syz-imagegen	[no test files]
?   	github.com/google/syzkaller/tools/syz-mutate	[no test files]
?   	github.com/google/syzkaller/tools/syz-prog2c	[no test files]
?   	github.com/google/syzkaller/tools/syz-repro	[no test files]
?   	github.com/google/syzkaller/tools/syz-reprolist	[no test files]
?   	github.com/google/syzkaller/tools/syz-runtest	[no test files]
?   	github.com/google/syzkaller/tools/syz-showprio	[no test files]
?   	github.com/google/syzkaller/tools/syz-stress	[no test files]
?   	github.com/google/syzkaller/tools/syz-symbolize	[no test files]
?   	github.com/google/syzkaller/tools/syz-testbuild	[no test files]
?   	github.com/google/syzkaller/tools/syz-trace2syz	[no test files]
ok  	github.com/google/syzkaller/tools/syz-trace2syz/parser	2.976s
ok  	github.com/google/syzkaller/tools/syz-trace2syz/proggen	3.620s
?   	github.com/google/syzkaller/tools/syz-tty	[no test files]
?   	github.com/google/syzkaller/tools/syz-upgrade	[no test files]
?   	github.com/google/syzkaller/tools/syz-usbgen	[no test files]
ok  	github.com/google/syzkaller/vm	15.348s
?   	github.com/google/syzkaller/vm/adb	[no test files]
?   	github.com/google/syzkaller/vm/bhyve	[no test files]
?   	github.com/google/syzkaller/vm/gce	[no test files]
?   	github.com/google/syzkaller/vm/gvisor	[no test files]
?   	github.com/google/syzkaller/vm/isolated	[no test files]
?   	github.com/google/syzkaller/vm/kvm	[no test files]
?   	github.com/google/syzkaller/vm/odroid	[no test files]
?   	github.com/google/syzkaller/vm/qemu	[no test files]
ok  	github.com/google/syzkaller/vm/vmimpl	(cached)
?   	github.com/google/syzkaller/vm/vmm	[no test files]