?   	github.com/google/syzkaller/dashboard/api	[no test files]
?   	github.com/google/syzkaller/pkg/clangtool	[no test files]
?   	github.com/google/syzkaller/pkg/coveragedb/mocks	[no test files]
?   	github.com/google/syzkaller/pkg/coveragedb/spannerclient	[no test files]
?   	github.com/google/syzkaller/pkg/covermerger/mocks	[no test files]
?   	github.com/google/syzkaller/pkg/debugtracer	[no test files]
?   	github.com/google/syzkaller/pkg/declextract	[no test files]
?   	github.com/google/syzkaller/pkg/gcs	[no test files]
?   	github.com/google/syzkaller/pkg/hash	[no test files]
?   	github.com/google/syzkaller/pkg/ifaceprobe	[no test files]
?   	github.com/google/syzkaller/pkg/ifuzz/arm64/gen	[no test files]
?   	github.com/google/syzkaller/pkg/ifuzz/arm64/generated	[no test files]
?   	github.com/google/syzkaller/pkg/ifuzz/iset	[no test files]
?   	github.com/google/syzkaller/pkg/ifuzz/powerpc	[no test files]
?   	github.com/google/syzkaller/pkg/ifuzz/powerpc/generated	[no test files]
?   	github.com/google/syzkaller/pkg/ifuzz/x86	[no test files]
?   	github.com/google/syzkaller/pkg/ifuzz/x86/gen	[no test files]
?   	github.com/google/syzkaller/pkg/ifuzz/x86/generated	[no test files]
ok  	github.com/google/syzkaller/dashboard/app	6.430s
ok  	github.com/google/syzkaller/dashboard/dashapi	(cached)
ok  	github.com/google/syzkaller/executor	2.253s
ok  	github.com/google/syzkaller/pkg/asset	(cached)
ok  	github.com/google/syzkaller/pkg/ast	2.526s
ok  	github.com/google/syzkaller/pkg/auth	(cached)
?   	github.com/google/syzkaller/pkg/kcidb	[no test files]
?   	github.com/google/syzkaller/pkg/report/crash	[no test files]
?   	github.com/google/syzkaller/pkg/rpcserver/mocks	[no test files]
?   	github.com/google/syzkaller/pkg/rpctype	[no test files]
?   	github.com/google/syzkaller/pkg/stat/syzbotstats	[no test files]
?   	github.com/google/syzkaller/pkg/testutil	[no test files]
?   	github.com/google/syzkaller/pkg/tools	[no test files]
?   	github.com/google/syzkaller/sys	[no test files]
?   	github.com/google/syzkaller/sys/darwin	[no test files]
?   	github.com/google/syzkaller/sys/freebsd	[no test files]
?   	github.com/google/syzkaller/sys/fuchsia	[no test files]
?   	github.com/google/syzkaller/sys/fuchsia/fidlgen	[no test files]
?   	github.com/google/syzkaller/sys/fuchsia/layout	[no test files]
?   	github.com/google/syzkaller/sys/generated	[no test files]
?   	github.com/google/syzkaller/sys/syz-extract	[no test files]
?   	github.com/google/syzkaller/sys/syz-sysgen	[no test files]
?   	github.com/google/syzkaller/sys/targets	[no test files]
?   	github.com/google/syzkaller/sys/test	[no test files]
?   	github.com/google/syzkaller/sys/trusty	[no test files]
?   	github.com/google/syzkaller/sys/windows	[no test files]
?   	github.com/google/syzkaller/syz-cluster/dashboard	[no test files]
?   	github.com/google/syzkaller/syz-cluster/db-mgmt	[no test files]
?   	github.com/google/syzkaller/syz-cluster/pkg/api	[no test files]
?   	github.com/google/syzkaller/syz-cluster/pkg/app	[no test files]
?   	github.com/google/syzkaller/syz-cluster/pkg/service	[no test files]
?   	github.com/google/syzkaller/syz-cluster/pkg/workflow	[no test files]
?   	github.com/google/syzkaller/syz-cluster/workflow/boot-step	[no test files]
?   	github.com/google/syzkaller/syz-cluster/workflow/build-step	[no test files]
?   	github.com/google/syzkaller/syz-cluster/workflow/triage-step	[no test files]
?   	github.com/google/syzkaller/tools/arm64	[no test files]
?   	github.com/google/syzkaller/tools/syz-benchcmp	[no test files]
?   	github.com/google/syzkaller/tools/syz-bisect	[no test files]
?   	github.com/google/syzkaller/tools/syz-build	[no test files]
?   	github.com/google/syzkaller/tools/syz-check	[no test files]
?   	github.com/google/syzkaller/tools/syz-cover	[no test files]
?   	github.com/google/syzkaller/tools/syz-covermerger	[no test files]
?   	github.com/google/syzkaller/tools/syz-crush	[no test files]
?   	github.com/google/syzkaller/tools/syz-db-export	[no test files]
?   	github.com/google/syzkaller/tools/syz-diff	[no test files]
?   	github.com/google/syzkaller/tools/syz-execprog	[no test files]
?   	github.com/google/syzkaller/tools/syz-expand	[no test files]
?   	github.com/google/syzkaller/tools/syz-fillreports	[no test files]
?   	github.com/google/syzkaller/tools/syz-fix-analyzer	[no test files]
?   	github.com/google/syzkaller/tools/syz-fmt	[no test files]
?   	github.com/google/syzkaller/tools/syz-gemini-seed	[no test files]
?   	github.com/google/syzkaller/tools/syz-hubtool	[no test files]
?   	github.com/google/syzkaller/tools/syz-imagegen	[no test files]
?   	github.com/google/syzkaller/tools/syz-kcidb	[no test files]
?   	github.com/google/syzkaller/tools/syz-lore	[no test files]
?   	github.com/google/syzkaller/tools/syz-make	[no test files]
?   	github.com/google/syzkaller/tools/syz-minconfig	[no test files]
?   	github.com/google/syzkaller/tools/syz-mutate	[no test files]
?   	github.com/google/syzkaller/tools/syz-prog2c	[no test files]
?   	github.com/google/syzkaller/tools/syz-query-subsystems	[no test files]
?   	github.com/google/syzkaller/tools/syz-reporter	[no test files]
?   	github.com/google/syzkaller/tools/syz-repro	[no test files]
?   	github.com/google/syzkaller/tools/syz-showprio	[no test files]
?   	github.com/google/syzkaller/tools/syz-symbolize	[no test files]
?   	github.com/google/syzkaller/tools/syz-testbuild	[no test files]
?   	github.com/google/syzkaller/tools/syz-trace2syz	[no test files]
?   	github.com/google/syzkaller/tools/syz-tty	[no test files]
?   	github.com/google/syzkaller/tools/syz-upgrade	[no test files]
?   	github.com/google/syzkaller/tools/syz-usbgen	[no test files]
?   	github.com/google/syzkaller/vm/adb	[no test files]
?   	github.com/google/syzkaller/vm/bhyve	[no test files]
?   	github.com/google/syzkaller/vm/cuttlefish	[no test files]
?   	github.com/google/syzkaller/vm/gce	[no test files]
?   	github.com/google/syzkaller/vm/gvisor	[no test files]
?   	github.com/google/syzkaller/vm/proxyapp/mocks	[no test files]
?   	github.com/google/syzkaller/vm/proxyapp/proxyrpc	[no test files]
?   	github.com/google/syzkaller/vm/qemu	[no test files]
?   	github.com/google/syzkaller/vm/starnix	[no test files]
?   	github.com/google/syzkaller/vm/vmm	[no test files]
?   	github.com/google/syzkaller/vm/vmware	[no test files]
ok  	github.com/google/syzkaller/pkg/bisect	42.673s
ok  	github.com/google/syzkaller/pkg/bisect/minimize	(cached)
ok  	github.com/google/syzkaller/pkg/build	19.150s
ok  	github.com/google/syzkaller/pkg/compiler	21.865s
ok  	github.com/google/syzkaller/pkg/config	(cached)
ok  	github.com/google/syzkaller/pkg/corpus	9.271s
ok  	github.com/google/syzkaller/pkg/cover	8.758s
ok  	github.com/google/syzkaller/pkg/cover/backend	9.063s
ok  	github.com/google/syzkaller/pkg/coveragedb	(cached)
ok  	github.com/google/syzkaller/pkg/covermerger	(cached)
ok  	github.com/google/syzkaller/pkg/csource	56.230s
ok  	github.com/google/syzkaller/pkg/db	(cached)
ok  	github.com/google/syzkaller/pkg/email	(cached)
ok  	github.com/google/syzkaller/pkg/email/lore	(cached)
ok  	github.com/google/syzkaller/pkg/flatrpc	(cached)
ok  	github.com/google/syzkaller/pkg/fuzzer	41.325s
ok  	github.com/google/syzkaller/pkg/fuzzer/queue	(cached)
ok  	github.com/google/syzkaller/pkg/gce	(cached)
ok  	github.com/google/syzkaller/pkg/html	(cached)
ok  	github.com/google/syzkaller/pkg/html/pages	(cached)
ok  	github.com/google/syzkaller/pkg/ifuzz	(cached)
ok  	github.com/google/syzkaller/pkg/ifuzz/arm64	(cached)
ok  	github.com/google/syzkaller/pkg/image	20.507s
ok  	github.com/google/syzkaller/pkg/instance	9.642s
ok  	github.com/google/syzkaller/pkg/kconfig	(cached)
ok  	github.com/google/syzkaller/pkg/kd	(cached)
ok  	github.com/google/syzkaller/pkg/log	(cached)
ok  	github.com/google/syzkaller/pkg/manager	12.520s
ok  	github.com/google/syzkaller/pkg/mgrconfig	17.421s
ok  	github.com/google/syzkaller/pkg/osutil	(cached)
ok  	github.com/google/syzkaller/pkg/report	26.230s
ok  	github.com/google/syzkaller/pkg/repro	13.168s
ok  	github.com/google/syzkaller/pkg/rpcserver	29.526s
--- FAIL: TestUnit (0.00s)
    --- FAIL: TestUnit/64_fork (48.37s)
        run.go:77: align0  C                             : FAIL: run 0: wrong call 0 result 14, want 0
            	executing program
            	### start
            	### call=0 errno=14
            	### call=1 errno=9
            	### call=2 errno=14
            	
        run.go:77: align0  C/repeat C                    : FAIL: run 0: wrong call 0 result 14, want 0
            	executing program
            	### start
            	### call=0 errno=14
            	### call=1 errno=9
            	### call=2 errno=14
            	executing program
            	### start
            	### call=0 errno=14
            	### call=1 errno=9
            	### call=2 errno=14
            	executing program
            	### start
            	### call=0 errno=14
            	### call=1 errno=9
            	### call=2 errno=14
            	
        run.go:77: align0  C/repeat C/thr C              : FAIL: run 0: wrong call 0 result 14, want 0
            	executing program
            	### start
            	### call=0 errno=14
            	### call=1 errno=9
            	### call=2 errno=14
            	
        run.go:77: align0  C/repeat C/thr C/repeat C     : FAIL: run 0: wrong call 0 result 14, want 0
            	executing program
            	### start
            	### call=0 errno=14
            	### call=1 errno=9
            	### call=2 errno=14
            	executing program
            	### start
            	### call=0 errno=14
            	### call=1 errno=9
            	### call=2 errno=14
            	executing program
            	### start
            	### call=0 errno=14
            	### call=1 errno=9
            	### call=2 errno=14
            	
        run.go:77: align0 none                           : FAIL: run 0: wrong call 0 result 14, want 0
        run.go:77: align0 none C                         : FAIL: run 0: wrong call 0 result 14, want 0
            	executing program
            	### start
            	### call=0 errno=14
            	### call=1 errno=9
            	### call=2 errno=14
            	
        run.go:77: align0 none C/repeat C                : FAIL: run 0: wrong call 0 result 14, want 0
            	executing program
            	### start
            	### call=0 errno=14
            	### call=1 errno=9
            	### call=2 errno=14
            	executing program
            	### start
            	### call=0 errno=14
            	### call=1 errno=9
            	### call=2 errno=14
            	executing program
            	### start
            	### call=0 errno=14
            	### call=1 errno=9
            	### call=2 errno=14
            	
        run.go:77: align0 none C/repeat C/thr            : FAIL: run 0: wrong call 0 result 14, want 0
        run.go:77: align0 none C/repeat C/thr C          : FAIL: run 0: wrong call 0 result 14, want 0
            	executing program
            	### start
            	### call=0 errno=14
            	### call=1 errno=9
            	### call=2 errno=14
            	
        run.go:77: align0 none C/repeat C/thr C/repeat C : FAIL: run 0: wrong call 0 result 14, want 0
            	executing program
            	### start
            	### call=0 errno=14
            	### call=1 errno=9
            	### call=2 errno=14
            	executing program
            	### start
            	### call=0 errno=14
            	### call=1 errno=9
            	### call=2 errno=14
            	executing program
            	### start
            	### call=0 errno=14
            	### call=1 errno=9
            	### call=2 errno=14
            	
        run.go:77: align0_be  C                          : SKIP (excluded by constraints)
        run.go:77: align0_be  C/repeat C                 : SKIP (excluded by constraints)
        run.go:77: align0_be  C/repeat C/thr C           : SKIP (excluded by constraints)
        run.go:77: align0_be  C/repeat C/thr C/repeat C  : SKIP (excluded by constraints)
        run.go:77: align0_be none                        : SKIP (excluded by constraints)
        run.go:77: align0_be none C                      : SKIP (excluded by constraints)
        run.go:77: align0_be none C/repeat C             : SKIP (excluded by constraints)
        run.go:77: align0_be none C/repeat C/thr         : SKIP (excluded by constraints)
        run.go:77: align0_be none C/repeat C/thr C       : SKIP (excluded by constraints)
        run.go:77: align0_be none C/repeat C/thr C/repeat C: SKIP (excluded by constraints)
        run.go:77: align3  C                             : FAIL: run 0: wrong call 0 result 14, want 0
            	executing program
            	### start
            	### call=0 errno=14
            	
        run.go:77: align3  C/repeat C                    : FAIL: run 0: wrong call 0 result 14, want 0
            	executing program
            	### start
            	### call=0 errno=14
            	executing program
            	### start
            	### call=0 errno=14
            	executing program
            	### start
            	### call=0 errno=14
            	
        run.go:77: align3  C/repeat C/thr C              : FAIL: run 0: wrong call 0 result 14, want 0
            	executing program
            	### start
            	### call=0 errno=14
            	
        run.go:77: align3  C/repeat C/thr C/repeat C     : FAIL: run 0: wrong call 0 result 14, want 0
            	executing program
            	### start
            	### call=0 errno=14
            	executing program
            	### start
            	### call=0 errno=14
            	executing program
            	### start
            	### call=0 errno=14
            	
        run.go:77: align3 none                           : FAIL: run 0: wrong call 0 result 14, want 0
        run.go:77: align3 none C                         : FAIL: run 0: wrong call 0 result 14, want 0
            	executing program
            	### start
            	### call=0 errno=14
            	
        run.go:77: align3 none C/repeat C                : FAIL: run 0: wrong call 0 result 14, want 0
            	executing program
            	### start
            	### call=0 errno=14
            	executing program
            	### start
            	### call=0 errno=14
            	executing program
            	### start
            	### call=0 errno=14
            	
        run.go:77: align3 none C/repeat C/thr            : FAIL: run 0: wrong call 0 result 14, want 0
        run.go:77: align3 none C/repeat C/thr C          : FAIL: run 0: wrong call 0 result 14, want 0
            	executing program
            	### start
            	### call=0 errno=14
            	
        run.go:77: align3 none C/repeat C/thr C/repeat C : FAIL: run 0: wrong call 0 result 14, want 0
            	executing program
            	### start
            	### call=0 errno=14
            	executing program
            	### start
            	### call=0 errno=14
            	executing program
            	### start
            	### call=0 errno=14
            	
        run.go:77: bf  C                                 : FAIL: run 0: wrong call 0 result 14, want 0
            	executing program
            	### start
            	### call=0 errno=14
            	### call=1 errno=14
            	### call=2 errno=14
            	
        run.go:77: bf  C/repeat C                        : FAIL: run 0: wrong call 0 result 14, want 0
            	executing program
            	### start
            	### call=0 errno=14
            	### call=1 errno=14
            	### call=2 errno=14
            	executing program
            	### start
            	### call=0 errno=14
            	### call=1 errno=14
            	### call=2 errno=14
            	executing program
            	### start
            	### call=0 errno=14
            	### call=1 errno=14
            	### call=2 errno=14
            	
        run.go:77: bf  C/repeat C/thr C                  : FAIL: run 0: wrong call 0 result 14, want 0
            	executing program
            	### start
            	### call=0 errno=14
            	### call=1 errno=14
            	### call=2 errno=14
            	
        run.go:77: bf  C/repeat C/thr C/repeat C         : FAIL: run 0: wrong call 0 result 14, want 0
            	executing program
            	### start
            	### call=0 errno=14
            	### call=1 errno=14
            	### call=2 errno=14
            	executing program
            	### start
            	### call=0 errno=14
            	### call=1 errno=14
            	### call=2 errno=14
            	executing program
            	### start
            	### call=0 errno=14
            	### call=1 errno=14
            	### call=2 errno=14
            	
        run.go:77: bf none                               : FAIL: run 0: wrong call 0 result 14, want 0
        run.go:77: bf none C                             : FAIL: run 0: wrong call 0 result 14, want 0
            	executing program
            	### start
            	### call=0 errno=14
            	### call=1 errno=14
            	### call=2 errno=14
            	
        run.go:77: bf none C/repeat C                    : FAIL: run 0: wrong call 0 result 14, want 0
            	executing program
            	### start
            	### call=0 errno=14
            	### call=1 errno=14
            	### call=2 errno=14
            	executing program
            	### start
            	### call=0 errno=14
            	### call=1 errno=14
            	### call=2 errno=14
            	executing program
            	### start
            	### call=0 errno=14
            	### call=1 errno=14
            	### call=2 errno=14
            	
        run.go:77: bf none C/repeat C/thr                : FAIL: run 0: wrong call 0 result 14, want 0
        run.go:77: bf none C/repeat C/thr C              : FAIL: run 0: wrong call 0 result 14, want 0
            	executing program
            	### start
            	### call=0 errno=14
            	### call=1 errno=14
            	### call=2 errno=14
            	
        run.go:77: bf none C/repeat C/thr C/repeat C     : FAIL: run 0: wrong call 0 result 14, want 0
            	executing program
            	### start
            	### call=0 errno=14
            	### call=1 errno=14
            	### call=2 errno=14
            	executing program
            	### start
            	### call=0 errno=14
            	### call=1 errno=14
            	### call=2 errno=14
            	executing program
            	### start
            	### call=0 errno=14
            	### call=1 errno=14
            	### call=2 errno=14
            	
        run.go:77: bf2  C                                : FAIL: run 0: wrong call 0 result 14, want 0
            	executing program
            	### start
            	### call=0 errno=14
            	### call=1 errno=14
            	### call=2 errno=14
            	### call=3 errno=14
            	### call=4 errno=14
            	### call=5 errno=14
            	### call=6 errno=14
            	### call=7 errno=14
            	### call=8 errno=14
            	### call=9 errno=14
            	### call=10 errno=14
            	### call=11 errno=14
            	### call=12 errno=14
            	### call=13 errno=14
            	### call=14 errno=14
            	### call=15 errno=14
            	### call=16 errno=14
            	### call=17 errno=14
            	### call=18 errno=14
            	### call=19 errno=14
            	### call=20 errno=14
            	### call=21 errno=14
            	
        run.go:77: bf2  C/repeat C                       : FAIL: run 0: wrong call 0 result 14, want 0
            	executing program
            	### start
            	### call=0 errno=14
            	### call=1 errno=14
            	### call=2 errno=14
            	### call=3 errno=14
            	### call=4 errno=14
            	### call=5 errno=14
            	### call=6 errno=14
            	### call=7 errno=14
            	### call=8 errno=14
            	### call=9 errno=14
            	### call=10 errno=14
            	### call=11 errno=14
            	### call=12 errno=14
            	### call=13 errno=14
            	### call=14 errno=14
            	### call=15 errno=14
            	### call=16 errno=14
            	### call=17 errno=14
            	### call=18 errno=14
            	### call=19 errno=14
            	### call=20 errno=14
            	### call=21 errno=14
            	executing program
            	### start
            	### call=0 errno=14
            	### call=1 errno=14
            	### call=2 errno=14
            	### call=3 errno=14
            	### call=4 errno=14
            	### call=5 errno=14
            	### call=6 errno=14
            	### call=7 errno=14
            	### call=8 errno=14
            	### call=9 errno=14
            	### call=10 errno=14
            	### call=11 errno=14
            	### call=12 errno=14
            	### call=13 errno=14
            	### call=14 errno=14
            	### call=15 errno=14
            	### call=16 errno=14
            	### call=17 errno=14
            	### call=18 errno=14
            	### call=19 errno=14
            	### call=20 errno=14
            	### call=21 errno=14
            	executing program
            	### start
            	### call=0 errno=14
            	### call=1 errno=14
            	### call=2 errno=14
            	### call=3 errno=14
            	### call=4 errno=14
            	### call=5 errno=14
            	### call=6 errno=14
            	### call=7 errno=14
            	### call=8 errno=14
            	### call=9 errno=14
            	### call=10 errno=14
            	### call=11 errno=14
            	### call=12 errno=14
            	### call=13 errno=14
            	### call=14 errno=14
            	### call=15 errno=14
            	### call=16 errno=14
            	### call=17 errno=14
            	### call=18 errno=14
            	### call=19 errno=14
            	### call=20 errno=14
            	### call=21 errno=14
            	
        run.go:77: bf2  C/repeat C/thr C                 : FAIL: run 0: wrong call 0 result 14, want 0
            	executing program
            	### start
            	### call=0 errno=14
            	### call=1 errno=14
            	### call=2 errno=14
            	### call=3 errno=14
            	### call=4 errno=14
            	### call=5 errno=14
            	### call=6 errno=14
            	### call=7 errno=14
            	### call=8 errno=14
            	### call=9 errno=14
            	### call=10 errno=14
            	### call=11 errno=14
            	### call=12 errno=14
            	### call=13 errno=14
            	### call=14 errno=14
            	### call=15 errno=14
            	### call=16 errno=14
            	### call=17 errno=14
            	### call=18 errno=14
            	### call=19 errno=14
            	### call=20 errno=14
            	### call=21 errno=14
            	
        run.go:77: bf2  C/repeat C/thr C/repeat C        : FAIL: run 0: wrong call 0 result 14, want 0
            	executing program
            	### start
            	### call=0 errno=14
            	### call=1 errno=14
            	### call=2 errno=14
            	### call=3 errno=14
            	### call=4 errno=14
            	### call=5 errno=14
            	### call=6 errno=14
            	### call=7 errno=14
            	### call=8 errno=14
            	### call=9 errno=14
            	### call=10 errno=14
            	### call=11 errno=14
            	### call=12 errno=14
            	### call=13 errno=14
            	### call=14 errno=14
            	### call=15 errno=14
            	### call=16 errno=14
            	### call=17 errno=14
            	### call=18 errno=14
            	### call=19 errno=14
            	### call=20 errno=14
            	### call=21 errno=14
            	executing program
            	### start
            	### call=0 errno=14
            	### call=1 errno=14
            	### call=2 errno=14
            	### call=3 errno=14
            	### call=4 errno=14
            	### call=5 errno=14
            	### call=6 errno=14
            	### call=7 errno=14
            	### call=8 errno=14
            	### call=9 errno=14
            	### call=10 errno=14
            	### call=11 errno=14
            	### call=12 errno=14
            	### call=13 errno=14
            	### call=14 errno=14
            	### call=15 errno=14
            	### call=16 errno=14
            	### call=17 errno=14
            	### call=18 errno=14
            	### call=19 errno=14
            	### call=20 errno=14
            	### call=21 errno=14
            	executing program
            	### start
            	### call=0 errno=14
            	### call=1 errno=14
            	### call=2 errno=14
            	### call=3 errno=14
            	### call=4 errno=14
            	### call=5 errno=14
            	### call=6 errno=14
            	### call=7 errno=14
            	### call=8 errno=14
            	### call=9 errno=14
            	### call=10 errno=14
            	### call=11 errno=14
            	### call=12 errno=14
            	### call=13 errno=14
            	### call=14 errno=14
            	### call=15 errno=14
            	### call=16 errno=14
            	### call=17 errno=14
            	### call=18 errno=14
            	### call=19 errno=14
            	### call=20 errno=14
            	### call=21 errno=14
            	
        run.go:77: bf2 none                              : FAIL: run 0: wrong call 0 result 14, want 0
        run.go:77: bf2 none C                            : FAIL: run 0: wrong call 0 result 14, want 0
            	executing program
            	### start
            	### call=0 errno=14
            	### call=1 errno=14
            	### call=2 errno=14
            	### call=3 errno=14
            	### call=4 errno=14
            	### call=5 errno=14
            	### call=6 errno=14
            	### call=7 errno=14
            	### call=8 errno=14
            	### call=9 errno=14
            	### call=10 errno=14
            	### call=11 errno=14
            	### call=12 errno=14
            	### call=13 errno=14
            	### call=14 errno=14
            	### call=15 errno=14
            	### call=16 errno=14
            	### call=17 errno=14
            	### call=18 errno=14
            	### call=19 errno=14
            	### call=20 errno=14
            	### call=21 errno=14
            	
        run.go:77: bf2 none C/repeat C                   : FAIL: run 0: wrong call 0 result 14, want 0
            	executing program
            	### start
            	### call=0 errno=14
            	### call=1 errno=14
            	### call=2 errno=14
            	### call=3 errno=14
            	### call=4 errno=14
            	### call=5 errno=14
            	### call=6 errno=14
            	### call=7 errno=14
            	### call=8 errno=14
            	### call=9 errno=14
            	### call=10 errno=14
            	### call=11 errno=14
            	### call=12 errno=14
            	### call=13 errno=14
            	### call=14 errno=14
            	### call=15 errno=14
            	### call=16 errno=14
            	### call=17 errno=14
            	### call=18 errno=14
            	### call=19 errno=14
            	### call=20 errno=14
            	### call=21 errno=14
            	executing program
            	### start
            	### call=0 errno=14
            	### call=1 errno=14
            	### call=2 errno=14
            	### call=3 errno=14
            	### call=4 errno=14
            	### call=5 errno=14
            	### call=6 errno=14
            	### call=7 errno=14
            	### call=8 errno=14
            	### call=9 errno=14
            	### call=10 errno=14
            	### call=11 errno=14
            	### call=12 errno=14
            	### call=13 errno=14
            	### call=14 errno=14
            	### call=15 errno=14
            	### call=16 errno=14
            	### call=17 errno=14
            	### call=18 errno=14
            	### call=19 errno=14
            	### call=20 errno=14
            	### call=21 errno=14
            	executing program
            	### start
            	### call=0 errno=14
            	### call=1 errno=14
            	### call=2 errno=14
            	### call=3 errno=14
            	### call=4 errno=14
            	### call=5 errno=14
            	### call=6 errno=14
            	### call=7 errno=14
            	### call=8 errno=14
            	### call=9 errno=14
            	### call=10 errno=14
            	### call=11 errno=14
            	### call=12 errno=14
            	### call=13 errno=14
            	### call=14 errno=14
            	### call=15 errno=14
            	### call=16 errno=14
            	### call=17 errno=14
            	### call=18 errno=14
            	### call=19 errno=14
            	### call=20 errno=14
            	### call=21 errno=14
            	
        run.go:77: bf2 none C/repeat C/thr               : FAIL: run 0: wrong call 0 result 14, want 0
        run.go:77: bf2 none C/repeat C/thr C             : FAIL: run 0: wrong call 0 result 14, want 0
            	executing program
            	### start
            	### call=0 errno=14
            	### call=1 errno=14
            	### call=2 errno=14
            	### call=3 errno=14
            	### call=4 errno=14
            	### call=5 errno=14
            	### call=6 errno=14
            	### call=7 errno=14
            	### call=8 errno=14
            	### call=9 errno=14
            	### call=10 errno=14
            	### call=11 errno=14
            	### call=12 errno=14
            	### call=13 errno=14
            	### call=14 errno=14
            	### call=15 errno=14
            	### call=16 errno=14
            	### call=17 errno=14
            	### call=18 errno=14
            	### call=19 errno=14
            	### call=20 errno=14
            	### call=21 errno=14
            	
        run.go:77: bf2 none C/repeat C/thr C/repeat C    : FAIL: run 0: wrong call 0 result 14, want 0
            	executing program
            	### start
            	### call=0 errno=14
            	### call=1 errno=14
            	### call=2 errno=14
            	### call=3 errno=14
            	### call=4 errno=14
            	### call=5 errno=14
            	### call=6 errno=14
            	### call=7 errno=14
            	### call=8 errno=14
            	### call=9 errno=14
            	### call=10 errno=14
            	### call=11 errno=14
            	### call=12 errno=14
            	### call=13 errno=14
            	### call=14 errno=14
            	### call=15 errno=14
            	### call=16 errno=14
            	### call=17 errno=14
            	### call=18 errno=14
            	### call=19 errno=14
            	### call=20 errno=14
            	### call=21 errno=14
            	executing program
            	### start
            	### call=0 errno=14
            	### call=1 errno=14
            	### call=2 errno=14
            	### call=3 errno=14
            	### call=4 errno=14
            	### call=5 errno=14
            	### call=6 errno=14
            	### call=7 errno=14
            	### call=8 errno=14
            	### call=9 errno=14
            	### call=10 errno=14
            	### call=11 errno=14
            	### call=12 errno=14
            	### call=13 errno=14
            	### call=14 errno=14
            	### call=15 errno=14
            	### call=16 errno=14
            	### call=17 errno=14
            	### call=18 errno=14
            	### call=19 errno=14
            	### call=20 errno=14
            	### call=21 errno=14
            	executing program
            	### start
            	### call=0 errno=14
            	### call=1 errno=14
            	### call=2 errno=14
            	### call=3 errno=14
            	### call=4 errno=14
            	### call=5 errno=14
            	### call=6 errno=14
            	### call=7 errno=14
            	### call=8 errno=14
            	### call=9 errno=14
            	### call=10 errno=14
            	### call=11 errno=14
            	### call=12 errno=14
            	### call=13 errno=14
            	### call=14 errno=14
            	### call=15 errno=14
            	### call=16 errno=14
            	### call=17 errno=14
            	### call=18 errno=14
            	### call=19 errno=14
            	### call=20 errno=14
            	### call=21 errno=14
            	
        run.go:77: bf2_be  C                             : SKIP (excluded by constraints)
        run.go:77: bf2_be  C/repeat C                    : SKIP (excluded by constraints)
        run.go:77: bf2_be  C/repeat C/thr C              : SKIP (excluded by constraints)
        run.go:77: bf2_be  C/repeat C/thr C/repeat C     : SKIP (excluded by constraints)
        run.go:77: bf2_be none                           : SKIP (excluded by constraints)
        run.go:77: bf2_be none C                         : SKIP (excluded by constraints)
        run.go:77: bf2_be none C/repeat C                : SKIP (excluded by constraints)
        run.go:77: bf2_be none C/repeat C/thr            : SKIP (excluded by constraints)
        run.go:77: bf2_be none C/repeat C/thr C          : SKIP (excluded by constraints)
        run.go:77: bf2_be none C/repeat C/thr C/repeat C : SKIP (excluded by constraints)
        run.go:77: bf_be  C                              : SKIP (excluded by constraints)
        run.go:77: bf_be  C/repeat C                     : SKIP (excluded by constraints)
        run.go:77: bf_be  C/repeat C/thr C               : SKIP (excluded by constraints)
        run.go:77: bf_be  C/repeat C/thr C/repeat C      : SKIP (excluded by constraints)
        run.go:77: bf_be none                            : SKIP (excluded by constraints)
        run.go:77: bf_be none C                          : SKIP (excluded by constraints)
        run.go:77: bf_be none C/repeat C                 : SKIP (excluded by constraints)
        run.go:77: bf_be none C/repeat C/thr             : SKIP (excluded by constraints)
        run.go:77: bf_be none C/repeat C/thr C           : SKIP (excluded by constraints)
        run.go:77: bf_be none C/repeat C/thr C/repeat C  : SKIP (excluded by constraints)
        run.go:77: errno  C                              : OK
        run.go:77: errno  C/repeat C                     : OK
        run.go:77: errno  C/repeat C/thr C               : OK
        run.go:77: errno  C/repeat C/thr C/repeat C      : OK
        run.go:77: errno none                            : OK
        run.go:77: errno none C                          : OK
        run.go:77: errno none C/repeat C                 : OK
        run.go:77: errno none C/repeat C/thr             : OK
        run.go:77: errno none C/repeat C/thr C           : OK
        run.go:77: errno none C/repeat C/thr C/repeat C  : OK
        run.go:77: exit0  C                              : OK
        run.go:77: exit0  C/repeat C                     : OK
        run.go:77: exit0  C/repeat C/thr C               : OK
        run.go:77: exit0  C/repeat C/thr C/repeat C      : OK
        run.go:77: exit0 none                            : OK
        run.go:77: exit0 none C                          : OK
        run.go:77: exit0 none C/repeat C                 : OK
        run.go:77: exit0 none C/repeat C/thr             : OK
        run.go:77: exit0 none C/repeat C/thr C           : OK
        run.go:77: exit0 none C/repeat C/thr C/repeat C  : OK
        run.go:77: exit1  C                              : OK
        run.go:77: exit1  C/repeat C                     : OK
        run.go:77: exit1  C/repeat C/thr C               : OK
        run.go:77: exit1  C/repeat C/thr C/repeat C      : OK
        run.go:77: exit1 none                            : OK
        run.go:77: exit1 none C                          : OK
        run.go:77: exit1 none C/repeat C                 : OK
        run.go:77: exit1 none C/repeat C/thr             : OK
        run.go:77: exit1 none C/repeat C/thr C           : OK
        run.go:77: exit1 none C/repeat C/thr C/repeat C  : OK
        run.go:77: expressions  C                        : FAIL: run 0: wrong call 0 result 14, want 0
            	executing program
            	### start
            	### call=0 errno=14
            	### call=1 errno=14
            	### call=2 errno=14
            	### call=3 errno=14
            	### call=4 errno=14
            	### call=5 errno=14
            	### call=6 errno=14
            	### call=7 errno=14
            	
        run.go:77: expressions  C/repeat C               : FAIL: run 0: wrong call 0 result 14, want 0
            	executing program
            	### start
            	### call=0 errno=14
            	### call=1 errno=14
            	### call=2 errno=14
            	### call=3 errno=14
            	### call=4 errno=14
            	### call=5 errno=14
            	### call=6 errno=14
            	### call=7 errno=14
            	executing program
            	### start
            	### call=0 errno=14
            	### call=1 errno=14
            	### call=2 errno=14
            	### call=3 errno=14
            	### call=4 errno=14
            	### call=5 errno=14
            	### call=6 errno=14
            	### call=7 errno=14
            	executing program
            	### start
            	### call=0 errno=14
            	### call=1 errno=14
            	### call=2 errno=14
            	### call=3 errno=14
            	### call=4 errno=14
            	### call=5 errno=14
            	### call=6 errno=14
            	### call=7 errno=14
            	
        run.go:77: expressions  C/repeat C/thr C         : FAIL: run 0: wrong call 0 result 14, want 0
            	executing program
            	### start
            	### call=0 errno=14
            	### call=1 errno=14
            	### call=2 errno=14
            	### call=3 errno=14
            	### call=4 errno=14
            	### call=5 errno=14
            	### call=6 errno=14
            	### call=7 errno=14
            	
        run.go:77: expressions  C/repeat C/thr C/repeat C: FAIL: run 0: wrong call 0 result 14, want 0
            	executing program
            	### start
            	### call=0 errno=14
            	### call=1 errno=14
            	### call=2 errno=14
            	### call=3 errno=14
            	### call=4 errno=14
            	### call=5 errno=14
            	### call=6 errno=14
            	### call=7 errno=14
            	executing program
            	### start
            	### call=0 errno=14
            	### call=1 errno=14
            	### call=2 errno=14
            	### call=3 errno=14
            	### call=4 errno=14
            	### call=5 errno=14
            	### call=6 errno=14
            	### call=7 errno=14
            	executing program
            	### start
            	### call=0 errno=14
            	### call=1 errno=14
            	### call=2 errno=14
            	### call=3 errno=14
            	### call=4 errno=14
            	### call=5 errno=14
            	### call=6 errno=14
            	### call=7 errno=14
            	
        run.go:77: expressions none                      : FAIL: run 0: wrong call 0 result 14, want 0
        run.go:77: expressions none C                    : FAIL: run 0: wrong call 0 result 14, want 0
            	executing program
            	### start
            	### call=0 errno=14
            	### call=1 errno=14
            	### call=2 errno=14
            	### call=3 errno=14
            	### call=4 errno=14
            	### call=5 errno=14
            	### call=6 errno=14
            	### call=7 errno=14
            	
        run.go:77: expressions none C/repeat C           : FAIL: run 0: wrong call 0 result 14, want 0
            	executing program
            	### start
            	### call=0 errno=14
            	### call=1 errno=14
            	### call=2 errno=14
            	### call=3 errno=14
            	### call=4 errno=14
            	### call=5 errno=14
            	### call=6 errno=14
            	### call=7 errno=14
            	executing program
            	### start
            	### call=0 errno=14
            	### call=1 errno=14
            	### call=2 errno=14
            	### call=3 errno=14
            	### call=4 errno=14
            	### call=5 errno=14
            	### call=6 errno=14
            	### call=7 errno=14
            	executing program
            	### start
            	### call=0 errno=14
            	### call=1 errno=14
            	### call=2 errno=14
            	### call=3 errno=14
            	### call=4 errno=14
            	### call=5 errno=14
            	### call=6 errno=14
            	### call=7 errno=14
            	
        run.go:77: expressions none C/repeat C/thr       : FAIL: run 0: wrong call 0 result 14, want 0
        run.go:77: expressions none C/repeat C/thr C     : FAIL: run 0: wrong call 0 result 14, want 0
            	executing program
            	### start
            	### call=0 errno=14
            	### call=1 errno=14
            	### call=2 errno=14
            	### call=3 errno=14
            	### call=4 errno=14
            	### call=5 errno=14
            	### call=6 errno=14
            	### call=7 errno=14
            	
        run.go:77: expressions none C/repeat C/thr C/repeat C: FAIL: run 0: wrong call 0 result 14, want 0
            	executing program
            	### start
            	### call=0 errno=14
            	### call=1 errno=14
            	### call=2 errno=14
            	### call=3 errno=14
            	### call=4 errno=14
            	### call=5 errno=14
            	### call=6 errno=14
            	### call=7 errno=14
            	executing program
            	### start
            	### call=0 errno=14
            	### call=1 errno=14
            	### call=2 errno=14
            	### call=3 errno=14
            	### call=4 errno=14
            	### call=5 errno=14
            	### call=6 errno=14
            	### call=7 errno=14
            	executing program
            	### start
            	### call=0 errno=14
            	### call=1 errno=14
            	### call=2 errno=14
            	### call=3 errno=14
            	### call=4 errno=14
            	### call=5 errno=14
            	### call=6 errno=14
            	### call=7 errno=14
            	
        run.go:77: expressions_be  C                     : SKIP (excluded by constraints)
        run.go:77: expressions_be  C/repeat C            : SKIP (excluded by constraints)
        run.go:77: expressions_be  C/repeat C/thr C      : SKIP (excluded by constraints)
        run.go:77: expressions_be  C/repeat C/thr C/repeat C: SKIP (excluded by constraints)
        run.go:77: expressions_be none                   : SKIP (excluded by constraints)
        run.go:77: expressions_be none C                 : SKIP (excluded by constraints)
        run.go:77: expressions_be none C/repeat C        : SKIP (excluded by constraints)
        run.go:77: expressions_be none C/repeat C/thr    : SKIP (excluded by constraints)
        run.go:77: expressions_be none C/repeat C/thr C  : SKIP (excluded by constraints)
        run.go:77: expressions_be none C/repeat C/thr C/repeat C: SKIP (excluded by constraints)
        run.go:77: fmt  C                                : FAIL: run 0: wrong call 0 result 14, want 0
            	executing program
            	### start
            	### call=0 errno=14
            	### call=1 errno=14
            	### call=2 errno=14
            	### call=3 errno=14
            	
        run.go:77: fmt  C/repeat C                       : FAIL: run 0: wrong call 0 result 14, want 0
            	executing program
            	### start
            	### call=0 errno=14
            	### call=1 errno=14
            	### call=2 errno=14
            	### call=3 errno=14
            	executing program
            	### start
            	### call=0 errno=14
            	### call=1 errno=14
            	### call=2 errno=14
            	### call=3 errno=14
            	executing program
            	### start
            	### call=0 errno=14
            	### call=1 errno=14
            	### call=2 errno=14
            	### call=3 errno=14
            	
        run.go:77: fmt  C/repeat C/thr C                 : FAIL: run 0: wrong call 0 result 14, want 0
            	executing program
            	### start
            	### call=0 errno=14
            	### call=1 errno=14
            	### call=2 errno=14
            	### call=3 errno=14
            	
        run.go:77: fmt  C/repeat C/thr C/repeat C        : FAIL: run 0: wrong call 0 result 14, want 0
            	executing program
            	### start
            	### call=0 errno=14
            	### call=1 errno=14
            	### call=2 errno=14
            	### call=3 errno=14
            	executing program
            	### start
            	### call=0 errno=14
            	### call=1 errno=14
            	### call=2 errno=14
            	### call=3 errno=14
            	executing program
            	### start
            	### call=0 errno=14
            	### call=1 errno=14
            	### call=2 errno=14
            	### call=3 errno=14
            	
        run.go:77: fmt none                              : FAIL: run 0: wrong call 0 result 14, want 0
        run.go:77: fmt none C                            : FAIL: run 0: wrong call 0 result 14, want 0
            	executing program
            	### start
            	### call=0 errno=14
            	### call=1 errno=14
            	### call=2 errno=14
            	### call=3 errno=14
            	
        run.go:77: fmt none C/repeat C                   : FAIL: run 0: wrong call 0 result 14, want 0
            	executing program
            	### start
            	### call=0 errno=14
            	### call=1 errno=14
            	### call=2 errno=14
            	### call=3 errno=14
            	executing program
            	### start
            	### call=0 errno=14
            	### call=1 errno=14
            	### call=2 errno=14
            	### call=3 errno=14
            	executing program
            	### start
            	### call=0 errno=14
            	### call=1 errno=14
            	### call=2 errno=14
            	### call=3 errno=14
            	
        run.go:77: fmt none C/repeat C/thr               : FAIL: run 0: wrong call 0 result 14, want 0
        run.go:77: fmt none C/repeat C/thr C             : FAIL: run 0: wrong call 0 result 14, want 0
            	executing program
            	### start
            	### call=0 errno=14
            	### call=1 errno=14
            	### call=2 errno=14
            	### call=3 errno=14
            	
        run.go:77: fmt none C/repeat C/thr C/repeat C    : FAIL: run 0: wrong call 0 result 14, want 0
            	executing program
            	### start
            	### call=0 errno=14
            	### call=1 errno=14
            	### call=2 errno=14
            	### call=3 errno=14
            	executing program
            	### start
            	### call=0 errno=14
            	### call=1 errno=14
            	### call=2 errno=14
            	### call=3 errno=14
            	executing program
            	### start
            	### call=0 errno=14
            	### call=1 errno=14
            	### call=2 errno=14
            	### call=3 errno=14
            	
        run.go:77: nla  C                                : FAIL: run 0: wrong call 0 result 14, want 0
            	executing program
            	### start
            	### call=0 errno=14
            	### call=1 errno=14
            	### call=2 errno=14
            	### call=3 errno=14
            	### call=4 errno=14
            	### call=5 errno=14
            	### call=6 errno=14
            	### call=7 errno=14
            	### call=8 errno=14
            	### call=9 errno=14
            	### call=10 errno=14
            	
        run.go:77: nla  C/repeat C                       : FAIL: run 0: wrong call 0 result 14, want 0
            	executing program
            	### start
            	### call=0 errno=14
            	### call=1 errno=14
            	### call=2 errno=14
            	### call=3 errno=14
            	### call=4 errno=14
            	### call=5 errno=14
            	### call=6 errno=14
            	### call=7 errno=14
            	### call=8 errno=14
            	### call=9 errno=14
            	### call=10 errno=14
            	executing program
            	### start
            	### call=0 errno=14
            	### call=1 errno=14
            	### call=2 errno=14
            	### call=3 errno=14
            	### call=4 errno=14
            	### call=5 errno=14
            	### call=6 errno=14
            	### call=7 errno=14
            	### call=8 errno=14
            	### call=9 errno=14
            	### call=10 errno=14
            	executing program
            	### start
            	### call=0 errno=14
            	### call=1 errno=14
            	### call=2 errno=14
            	### call=3 errno=14
            	### call=4 errno=14
            	### call=5 errno=14
            	### call=6 errno=14
            	### call=7 errno=14
            	### call=8 errno=14
            	### call=9 errno=14
            	### call=10 errno=14
            	
        run.go:77: nla  C/repeat C/thr C                 : FAIL: run 0: wrong call 0 result 14, want 0
            	executing program
            	### start
            	### call=0 errno=14
            	### call=1 errno=14
            	### call=2 errno=14
            	### call=3 errno=14
            	### call=4 errno=14
            	### call=5 errno=14
            	### call=6 errno=14
            	### call=7 errno=14
            	### call=8 errno=14
            	### call=9 errno=14
            	### call=10 errno=14
            	
        run.go:77: nla  C/repeat C/thr C/repeat C        : FAIL: run 0: wrong call 0 result 14, want 0
            	executing program
            	### start
            	### call=0 errno=14
            	### call=1 errno=14
            	### call=2 errno=14
            	### call=3 errno=14
            	### call=4 errno=14
            	### call=5 errno=14
            	### call=6 errno=14
            	### call=7 errno=14
            	### call=8 errno=14
            	### call=9 errno=14
            	### call=10 errno=14
            	executing program
            	### start
            	### call=0 errno=14
            	### call=1 errno=14
            	### call=2 errno=14
            	### call=3 errno=14
            	### call=4 errno=14
            	### call=5 errno=14
            	### call=6 errno=14
            	### call=7 errno=14
            	### call=8 errno=14
            	### call=9 errno=14
            	### call=10 errno=14
            	executing program
            	### start
            	### call=0 errno=14
            	### call=1 errno=14
            	### call=2 errno=14
            	### call=3 errno=14
            	### call=4 errno=14
            	### call=5 errno=14
            	### call=6 errno=14
            	### call=7 errno=14
            	### call=8 errno=14
            	### call=9 errno=14
            	### call=10 errno=14
            	
        run.go:77: nla none                              : FAIL: run 0: wrong call 0 result 14, want 0
        run.go:77: nla none C                            : FAIL: run 0: wrong call 0 result 14, want 0
            	executing program
            	### start
            	### call=0 errno=14
            	### call=1 errno=14
            	### call=2 errno=14
            	### call=3 errno=14
            	### call=4 errno=14
            	### call=5 errno=14
            	### call=6 errno=14
            	### call=7 errno=14
            	### call=8 errno=14
            	### call=9 errno=14
            	### call=10 errno=14
            	
        run.go:77: nla none C/repeat C                   : FAIL: run 0: wrong call 0 result 14, want 0
            	executing program
            	### start
            	### call=0 errno=14
            	### call=1 errno=14
            	### call=2 errno=14
            	### call=3 errno=14
            	### call=4 errno=14
            	### call=5 errno=14
            	### call=6 errno=14
            	### call=7 errno=14
            	### call=8 errno=14
            	### call=9 errno=14
            	### call=10 errno=14
            	executing program
            	### start
            	### call=0 errno=14
            	### call=1 errno=14
            	### call=2 errno=14
            	### call=3 errno=14
            	### call=4 errno=14
            	### call=5 errno=14
            	### call=6 errno=14
            	### call=7 errno=14
            	### call=8 errno=14
            	### call=9 errno=14
            	### call=10 errno=14
            	executing program
            	### start
            	### call=0 errno=14
            	### call=1 errno=14
            	### call=2 errno=14
            	### call=3 errno=14
            	### call=4 errno=14
            	### call=5 errno=14
            	### call=6 errno=14
            	### call=7 errno=14
            	### call=8 errno=14
            	### call=9 errno=14
            	### call=10 errno=14
            	
        run.go:77: nla none C/repeat C/thr               : FAIL: run 0: wrong call 0 result 14, want 0
        run.go:77: nla none C/repeat C/thr C             : FAIL: run 0: wrong call 0 result 14, want 0
            	executing program
            	### start
            	### call=0 errno=14
            	### call=1 errno=14
            	### call=2 errno=14
            	### call=3 errno=14
            	### call=4 errno=14
            	### call=5 errno=14
            	### call=6 errno=14
            	### call=7 errno=14
            	### call=8 errno=14
            	### call=9 errno=14
            	### call=10 errno=14
            	
        run.go:77: nla none C/repeat C/thr C/repeat C    : FAIL: run 0: wrong call 0 result 14, want 0
            	executing program
            	### start
            	### call=0 errno=14
            	### call=1 errno=14
            	### call=2 errno=14
            	### call=3 errno=14
            	### call=4 errno=14
            	### call=5 errno=14
            	### call=6 errno=14
            	### call=7 errno=14
            	### call=8 errno=14
            	### call=9 errno=14
            	### call=10 errno=14
            	executing program
            	### start
            	### call=0 errno=14
            	### call=1 errno=14
            	### call=2 errno=14
            	### call=3 errno=14
            	### call=4 errno=14
            	### call=5 errno=14
            	### call=6 errno=14
            	### call=7 errno=14
            	### call=8 errno=14
            	### call=9 errno=14
            	### call=10 errno=14
            	executing program
            	### start
            	### call=0 errno=14
            	### call=1 errno=14
            	### call=2 errno=14
            	### call=3 errno=14
            	### call=4 errno=14
            	### call=5 errno=14
            	### call=6 errno=14
            	### call=7 errno=14
            	### call=8 errno=14
            	### call=9 errno=14
            	### call=10 errno=14
            	
        run.go:77: nonfailing  C                         : OK
        run.go:77: nonfailing  C/repeat C                : OK
        run.go:77: nonfailing  C/repeat C/thr C          : OK
        run.go:77: nonfailing  C/repeat C/thr C/repeat C : OK
        run.go:77: nonfailing none                       : OK
        run.go:77: nonfailing none C                     : OK
        run.go:77: nonfailing none C/repeat C            : OK
        run.go:77: nonfailing none C/repeat C/thr        : OK
        run.go:77: nonfailing none C/repeat C/thr C      : OK
        run.go:77: nonfailing none C/repeat C/thr C/repeat C: OK
        run.go:77: overlay  C                            : FAIL: run 0: wrong call 0 result 14, want 0
            	executing program
            	### start
            	### call=0 errno=14
            	### call=1 errno=14
            	### call=2 errno=14
            	### call=3 errno=14
            	### call=4 errno=14
            	### call=5 errno=14
            	### call=6 errno=14
            	### call=7 errno=14
            	### call=8 errno=14
            	
        run.go:77: overlay  C/repeat C                   : FAIL: run 0: wrong call 0 result 14, want 0
            	executing program
            	### start
            	### call=0 errno=14
            	### call=1 errno=14
            	### call=2 errno=14
            	### call=3 errno=14
            	### call=4 errno=14
            	### call=5 errno=14
            	### call=6 errno=14
            	### call=7 errno=14
            	### call=8 errno=14
            	executing program
            	### start
            	### call=0 errno=14
            	### call=1 errno=14
            	### call=2 errno=14
            	### call=3 errno=14
            	### call=4 errno=14
            	### call=5 errno=14
            	### call=6 errno=14
            	### call=7 errno=14
            	### call=8 errno=14
            	executing program
            	### start
            	### call=0 errno=14
            	### call=1 errno=14
            	### call=2 errno=14
            	### call=3 errno=14
            	### call=4 errno=14
            	### call=5 errno=14
            	### call=6 errno=14
            	### call=7 errno=14
            	### call=8 errno=14
            	
        run.go:77: overlay  C/repeat C/thr C             : FAIL: run 0: wrong call 0 result 14, want 0
            	executing program
            	### start
            	### call=0 errno=14
            	### call=1 errno=14
            	### call=2 errno=14
            	### call=3 errno=14
            	### call=4 errno=14
            	### call=5 errno=14
            	### call=6 errno=14
            	### call=7 errno=14
            	### call=8 errno=14
            	
        run.go:77: overlay  C/repeat C/thr C/repeat C    : FAIL: run 0: wrong call 0 result 14, want 0
            	executing program
            	### start
            	### call=0 errno=14
            	### call=1 errno=14
            	### call=2 errno=14
            	### call=3 errno=14
            	### call=4 errno=14
            	### call=5 errno=14
            	### call=6 errno=14
            	### call=7 errno=14
            	### call=8 errno=14
            	executing program
            	### start
            	### call=0 errno=14
            	### call=1 errno=14
            	### call=2 errno=14
            	### call=3 errno=14
            	### call=4 errno=14
            	### call=5 errno=14
            	### call=6 errno=14
            	### call=7 errno=14
            	### call=8 errno=14
            	executing program
            	### start
            	### call=0 errno=14
            	### call=1 errno=14
            	### call=2 errno=14
            	### call=3 errno=14
            	### call=4 errno=14
            	### call=5 errno=14
            	### call=6 errno=14
            	### call=7 errno=14
            	### call=8 errno=14
            	
        run.go:77: overlay none                          : FAIL: run 0: wrong call 0 result 14, want 0
        run.go:77: overlay none C                        : FAIL: run 0: wrong call 0 result 14, want 0
            	executing program
            	### start
            	### call=0 errno=14
            	### call=1 errno=14
            	### call=2 errno=14
            	### call=3 errno=14
            	### call=4 errno=14
            	### call=5 errno=14
            	### call=6 errno=14
            	### call=7 errno=14
            	### call=8 errno=14
            	
        run.go:77: overlay none C/repeat C               : FAIL: run 0: wrong call 0 result 14, want 0
            	executing program
            	### start
            	### call=0 errno=14
            	### call=1 errno=14
            	### call=2 errno=14
            	### call=3 errno=14
            	### call=4 errno=14
            	### call=5 errno=14
            	### call=6 errno=14
            	### call=7 errno=14
            	### call=8 errno=14
            	executing program
            	### start
            	### call=0 errno=14
            	### call=1 errno=14
            	### call=2 errno=14
            	### call=3 errno=14
            	### call=4 errno=14
            	### call=5 errno=14
            	### call=6 errno=14
            	### call=7 errno=14
            	### call=8 errno=14
            	executing program
            	### start
            	### call=0 errno=14
            	### call=1 errno=14
            	### call=2 errno=14
            	### call=3 errno=14
            	### call=4 errno=14
            	### call=5 errno=14
            	### call=6 errno=14
            	### call=7 errno=14
            	### call=8 errno=14
            	
        run.go:77: overlay none C/repeat C/thr           : FAIL: run 0: wrong call 0 result 14, want 0
        run.go:77: overlay none C/repeat C/thr C         : FAIL: run 0: wrong call 0 result 14, want 0
            	executing program
            	### start
            	### call=0 errno=14
            	### call=1 errno=14
            	### call=2 errno=14
            	### call=3 errno=14
            	### call=4 errno=14
            	### call=5 errno=14
            	### call=6 errno=14
            	### call=7 errno=14
            	### call=8 errno=14
            	
        run.go:77: overlay none C/repeat C/thr C/repeat C: FAIL: run 0: wrong call 0 result 14, want 0
            	executing program
            	### start
            	### call=0 errno=14
            	### call=1 errno=14
            	### call=2 errno=14
            	### call=3 errno=14
            	### call=4 errno=14
            	### call=5 errno=14
            	### call=6 errno=14
            	### call=7 errno=14
            	### call=8 errno=14
            	executing program
            	### start
            	### call=0 errno=14
            	### call=1 errno=14
            	### call=2 errno=14
            	### call=3 errno=14
            	### call=4 errno=14
            	### call=5 errno=14
            	### call=6 errno=14
            	### call=7 errno=14
            	### call=8 errno=14
            	executing program
            	### start
            	### call=0 errno=14
            	### call=1 errno=14
            	### call=2 errno=14
            	### call=3 errno=14
            	### call=4 errno=14
            	### call=5 errno=14
            	### call=6 errno=14
            	### call=7 errno=14
            	### call=8 errno=14
            	
        run.go:77: overlay_be  C                         : SKIP (excluded by constraints)
        run.go:77: overlay_be  C/repeat C                : SKIP (excluded by constraints)
        run.go:77: overlay_be  C/repeat C/thr C          : SKIP (excluded by constraints)
        run.go:77: overlay_be  C/repeat C/thr C/repeat C : SKIP (excluded by constraints)
        run.go:77: overlay_be none                       : SKIP (excluded by constraints)
        run.go:77: overlay_be none C                     : SKIP (excluded by constraints)
        run.go:77: overlay_be none C/repeat C            : SKIP (excluded by constraints)
        run.go:77: overlay_be none C/repeat C/thr        : SKIP (excluded by constraints)
        run.go:77: overlay_be none C/repeat C/thr C      : SKIP (excluded by constraints)
        run.go:77: overlay_be none C/repeat C/thr C/repeat C: SKIP (excluded by constraints)
        run.go:77: sleep  C                              : SKIP (excluded by constraints)
        run.go:77: sleep  C/repeat C                     : SKIP (excluded by constraints)
        run.go:77: sleep  C/repeat C/thr C               : OK
        run.go:77: sleep  C/repeat C/thr C/repeat C      : OK
        run.go:77: sleep none                            : SKIP (excluded by constraints)
        run.go:77: sleep none C                          : SKIP (excluded by constraints)
        run.go:77: sleep none C/repeat C                 : SKIP (excluded by constraints)
        run.go:77: sleep none C/repeat C/thr             : OK
        run.go:77: sleep none C/repeat C/thr C           : OK
        run.go:77: sleep none C/repeat C/thr C/repeat C  : OK
        run.go:77: strings  C                            : FAIL: run 0: wrong call 0 result 14, want 0
            	executing program
            	### start
            	### call=0 errno=14
            	### call=1 errno=14
            	### call=2 errno=14
            	### call=3 errno=14
            	
        run.go:77: strings  C/repeat C                   : FAIL: run 0: wrong call 0 result 14, want 0
            	executing program
            	### start
            	### call=0 errno=14
            	### call=1 errno=14
            	### call=2 errno=14
            	### call=3 errno=14
            	executing program
            	### start
            	### call=0 errno=14
            	### call=1 errno=14
            	### call=2 errno=14
            	### call=3 errno=14
            	executing program
            	### start
            	### call=0 errno=14
            	### call=1 errno=14
            	### call=2 errno=14
            	### call=3 errno=14
            	
        run.go:77: strings  C/repeat C/thr C             : FAIL: run 0: wrong call 0 result 14, want 0
            	executing program
            	### start
            	### call=0 errno=14
            	### call=1 errno=14
            	### call=2 errno=14
            	### call=3 errno=14
            	
        run.go:77: strings  C/repeat C/thr C/repeat C    : FAIL: run 0: wrong call 0 result 14, want 0
            	executing program
            	### start
            	### call=0 errno=14
            	### call=1 errno=14
            	### call=2 errno=14
            	### call=3 errno=14
            	executing program
            	### start
            	### call=0 errno=14
            	### call=1 errno=14
            	### call=2 errno=14
            	### call=3 errno=14
            	executing program
            	### start
            	### call=0 errno=14
            	### call=1 errno=14
            	### call=2 errno=14
            	### call=3 errno=14
            	
        run.go:77: strings none                          : FAIL: run 0: wrong call 0 result 14, want 0
        run.go:77: strings none C                        : FAIL: run 0: wrong call 0 result 14, want 0
            	executing program
            	### start
            	### call=0 errno=14
            	### call=1 errno=14
            	### call=2 errno=14
            	### call=3 errno=14
            	
        run.go:77: strings none C/repeat C               : FAIL: run 0: wrong call 0 result 14, want 0
            	executing program
            	### start
            	### call=0 errno=14
            	### call=1 errno=14
            	### call=2 errno=14
            	### call=3 errno=14
            	executing program
            	### start
            	### call=0 errno=14
            	### call=1 errno=14
            	### call=2 errno=14
            	### call=3 errno=14
            	executing program
            	### start
            	### call=0 errno=14
            	### call=1 errno=14
            	### call=2 errno=14
            	### call=3 errno=14
            	
        run.go:77: strings none C/repeat C/thr           : FAIL: run 0: wrong call 0 result 14, want 0
        run.go:77: strings none C/repeat C/thr C         : FAIL: run 0: wrong call 0 result 14, want 0
            	executing program
            	### start
            	### call=0 errno=14
            	### call=1 errno=14
            	### call=2 errno=14
            	### call=3 errno=14
            	
        run.go:77: strings none C/repeat C/thr C/repeat C: FAIL: run 0: wrong call 0 result 14, want 0
            	executing program
            	### start
            	### call=0 errno=14
            	### call=1 errno=14
            	### call=2 errno=14
            	### call=3 errno=14
            	executing program
            	### start
            	### call=0 errno=14
            	### call=1 errno=14
            	### call=2 errno=14
            	### call=3 errno=14
            	executing program
            	### start
            	### call=0 errno=14
            	### call=1 errno=14
            	### call=2 errno=14
            	### call=3 errno=14
            	
        run.go:77: test  C                               : OK
        run.go:77: test  C/repeat C                      : OK
        run.go:77: test  C/repeat C/thr C                : OK
        run.go:77: test  C/repeat C/thr C/repeat C       : OK
        run.go:77: test none                             : OK
        run.go:77: test none C                           : OK
        run.go:77: test none C/repeat C                  : OK
        run.go:77: test none C/repeat C/thr              : OK
        run.go:77: test none C/repeat C/thr C            : OK
        run.go:77: test none C/repeat C/thr C/repeat C   : OK
        run.go:77: zero_args  C                          : OK
        run.go:77: zero_args  C/repeat C                 : OK
        run.go:77: zero_args  C/repeat C/thr C           : OK
        run.go:77: zero_args  C/repeat C/thr C/repeat C  : OK
        run.go:77: zero_args none                        : OK
        run.go:77: zero_args none C                      : OK
        run.go:77: zero_args none C/repeat C             : OK
        run.go:77: zero_args none C/repeat C/thr         : OK
        run.go:77: zero_args none C/repeat C/thr C       : OK
        run.go:77: zero_args none C/repeat C/thr C/repeat C: OK
        run.go:77: ok: 65, broken: 0, skip: 55, fail: 90
        run_test.go:121: tests failed
--- FAIL: TestZlib (13.21s)
    testutil.go:35: seed=1742579028602002186
    executor_test.go:139: data comparison failed: 998
        =================================================================
        ==538298==ERROR: AddressSanitizer: unknown-crash on address 0x200000000000 at pc 0xffff828a8f6c bp 0xffffd372cc30 sp 0xffffd372cc88
        WRITE of size 101439 at 0x200000000000 thread T0
            #0 0xffff828a8f68 in __interceptor_memcpy ../../../../src/libsanitizer/sanitizer_common/sanitizer_common_interceptors.inc:827
            #1 0x415f6c in execute_one() (/tmp/syz-executor3544422224+0x415f6c)
            #2 0x40a680 in loop() (/tmp/syz-executor3544422224+0x40a680)
            #3 0x40a48c in do_sandbox_none() (/tmp/syz-executor3544422224+0x40a48c)
            #4 0x413b00 in main (/tmp/syz-executor3544422224+0x413b00)
            #5 0xffff823d773c  (/lib/aarch64-linux-gnu/libc.so.6+0x2773c)
            #6 0xffff823d7814 in __libc_start_main (/lib/aarch64-linux-gnu/libc.so.6+0x27814)
            #7 0x4047ac in _start (/tmp/syz-executor3544422224+0x4047ac)
        
        Address 0x200000000000 is located in the high shadow area.
        SUMMARY: AddressSanitizer: unknown-crash ../../../../src/libsanitizer/sanitizer_common/sanitizer_common_interceptors.inc:827 in __interceptor_memcpy
        ==538298==ABORTING
--- FAIL: TestCover (0.05s)
    --- FAIL: TestCover/64_fork (9.10s)
        --- FAIL: TestCover/64_fork/2 (0.32s)
            run_test.go:432: 
                	Error Trace:	/syzkaller/gopath/src/github.com/google/syzkaller/pkg/runtest/run_test.go:432
                	            				/syzkaller/gopath/src/github.com/google/syzkaller/pkg/runtest/run_test.go:389
                	Error:      	Not equal: 
                	            	expected: []uint64{0xc0dec0dec0112233}
                	            	actual  : []uint64{0xc0dec0dec040b2b8}
                	            	
                	            	Diff:
                	            	--- Expected
                	            	+++ Actual
                	            	@@ -1,3 +1,3 @@
                	            	 ([]uint64) (len=1) {
                	            	- (uint64) 13897757563049550387
                	            	+ (uint64) 13897757563052667576
                	            	 }
                	Test:       	TestCover/64_fork/2
            run_test.go:433: 
                	Error Trace:	/syzkaller/gopath/src/github.com/google/syzkaller/pkg/runtest/run_test.go:433
                	            				/syzkaller/gopath/src/github.com/google/syzkaller/pkg/runtest/run_test.go:389
                	Error:      	Not equal: 
                	            	expected: []uint64{0xc0dec0dec0112233}
                	            	actual  : []uint64{0xc0dec0dec040b2b8}
                	            	
                	            	Diff:
                	            	--- Expected
                	            	+++ Actual
                	            	@@ -1,3 +1,3 @@
                	            	 ([]uint64) (len=1) {
                	            	- (uint64) 13897757563049550387
                	            	+ (uint64) 13897757563052667576
                	            	 }
                	Test:       	TestCover/64_fork/2
        --- FAIL: TestCover/64_fork/16 (0.35s)
            run_test.go:432: 
                	Error Trace:	/syzkaller/gopath/src/github.com/google/syzkaller/pkg/runtest/run_test.go:432
                	            				/syzkaller/gopath/src/github.com/google/syzkaller/pkg/runtest/run_test.go:389
                	Error:      	Not equal: 
                	            	expected: []uint64{0xc0dec0dec0000001, 0xc0dec0dec0000010, 0xc0dec0dec0000020, 0xc0dec0dec0000040, 0xc0dec0dec0000100, 0xc0dec0dec0001000, 0xc0dec0dec0002000}
                	            	actual  : []uint64{0xc0dec0dec040b2b8}
                	            	
                	            	Diff:
                	            	--- Expected
                	            	+++ Actual
                	            	@@ -1,9 +1,3 @@
                	            	-([]uint64) (len=7) {
                	            	- (uint64) 13897757563048427521,
                	            	- (uint64) 13897757563048427536,
                	            	- (uint64) 13897757563048427552,
                	            	- (uint64) 13897757563048427584,
                	            	- (uint64) 13897757563048427776,
                	            	- (uint64) 13897757563048431616,
                	            	- (uint64) 13897757563048435712
                	            	+([]uint64) (len=1) {
                	            	+ (uint64) 13897757563052667576
                	            	 }
                	Test:       	TestCover/64_fork/16
            run_test.go:433: 
                	Error Trace:	/syzkaller/gopath/src/github.com/google/syzkaller/pkg/runtest/run_test.go:433
                	            				/syzkaller/gopath/src/github.com/google/syzkaller/pkg/runtest/run_test.go:389
                	Error:      	Not equal: 
                	            	expected: []uint64{0xc0dec0dec0001100, 0xc0dec0dec0000140, 0xc0dec0dec0000011, 0xc0dec0dec0000001}
                	            	actual  : []uint64{0xc0dec0dec040b2b8}
                	            	
                	            	Diff:
                	            	--- Expected
                	            	+++ Actual
                	            	@@ -1,6 +1,3 @@
                	            	-([]uint64) (len=4) {
                	            	- (uint64) 13897757563048431872,
                	            	- (uint64) 13897757563048427840,
                	            	- (uint64) 13897757563048427537,
                	            	- (uint64) 13897757563048427521
                	            	+([]uint64) (len=1) {
                	            	+ (uint64) 13897757563052667576
                	            	 }
                	Test:       	TestCover/64_fork/16
        --- FAIL: TestCover/64_fork/15 (0.40s)
            run_test.go:433: 
                	Error Trace:	/syzkaller/gopath/src/github.com/google/syzkaller/pkg/runtest/run_test.go:433
                	            				/syzkaller/gopath/src/github.com/google/syzkaller/pkg/runtest/run_test.go:389
                	Error:      	Not equal: 
                	            	expected: []uint64{0xc0dec0dec0001100, 0xc0dec0dec0000102, 0xc0dec0dec0000012, 0xc0dec0dec0000011, 0xc0dec0dec0000001}
                	            	actual  : []uint64{0xc0dec0dec040b2b8}
                	            	
                	            	Diff:
                	            	--- Expected
                	            	+++ Actual
                	            	@@ -1,7 +1,3 @@
                	            	-([]uint64) (len=5) {
                	            	- (uint64) 13897757563048431872,
                	            	- (uint64) 13897757563048427778,
                	            	- (uint64) 13897757563048427538,
                	            	- (uint64) 13897757563048427537,
                	            	- (uint64) 13897757563048427521
                	            	+([]uint64) (len=1) {
                	            	+ (uint64) 13897757563052667576
                	            	 }
                	Test:       	TestCover/64_fork/15
        --- FAIL: TestCover/64_fork/4 (0.40s)
            run_test.go:432: 
                	Error Trace:	/syzkaller/gopath/src/github.com/google/syzkaller/pkg/runtest/run_test.go:432
                	            				/syzkaller/gopath/src/github.com/google/syzkaller/pkg/runtest/run_test.go:389
                	Error:      	Not equal: 
                	            	expected: []uint64{0xc0dec0dec0112233}
                	            	actual  : []uint64{0xc0dec0dec040b2b8}
                	            	
                	            	Diff:
                	            	--- Expected
                	            	+++ Actual
                	            	@@ -1,3 +1,3 @@
                	            	 ([]uint64) (len=1) {
                	            	- (uint64) 13897757563049550387
                	            	+ (uint64) 13897757563052667576
                	            	 }
                	Test:       	TestCover/64_fork/4
        --- FAIL: TestCover/64_fork/5 (0.42s)
            run_test.go:433: 
                	Error Trace:	/syzkaller/gopath/src/github.com/google/syzkaller/pkg/runtest/run_test.go:433
                	            				/syzkaller/gopath/src/github.com/google/syzkaller/pkg/runtest/run_test.go:389
                	Error:      	Not equal: 
                	            	expected: []uint64{0xc0dec0dec0112233}
                	            	actual  : []uint64{0xc0dec0dec040b2b8}
                	            	
                	            	Diff:
                	            	--- Expected
                	            	+++ Actual
                	            	@@ -1,3 +1,3 @@
                	            	 ([]uint64) (len=1) {
                	            	- (uint64) 13897757563049550387
                	            	+ (uint64) 13897757563052667576
                	            	 }
                	Test:       	TestCover/64_fork/5
        --- FAIL: TestCover/64_fork/8 (0.44s)
            run_test.go:433: 
                	Error Trace:	/syzkaller/gopath/src/github.com/google/syzkaller/pkg/runtest/run_test.go:433
                	            				/syzkaller/gopath/src/github.com/google/syzkaller/pkg/runtest/run_test.go:389
                	Error:      	Not equal: 
                	            	expected: []uint64{0xc0dec0dec0011b01, 0xc0dec0dec0044bf0, 0xc0dec0dec00330f2, 0xc0dec0dec0022003, 0xc0dec0dec0011001}
                	            	actual  : []uint64{0xc0dec0dec040b2b8}
                	            	
                	            	Diff:
                	            	--- Expected
                	            	+++ Actual
                	            	@@ -1,7 +1,3 @@
                	            	-([]uint64) (len=5) {
                	            	- (uint64) 13897757563048499969,
                	            	- (uint64) 13897757563048709104,
                	            	- (uint64) 13897757563048636658,
                	            	- (uint64) 13897757563048566787,
                	            	- (uint64) 13897757563048497153
                	            	+([]uint64) (len=1) {
                	            	+ (uint64) 13897757563052667576
                	            	 }
                	Test:       	TestCover/64_fork/8
        --- FAIL: TestCover/64_fork/13 (0.44s)
            run_test.go:432: 
                	Error Trace:	/syzkaller/gopath/src/github.com/google/syzkaller/pkg/runtest/run_test.go:432
                	            				/syzkaller/gopath/src/github.com/google/syzkaller/pkg/runtest/run_test.go:389
                	Error:      	Not equal: 
                	            	expected: []uint64{0xc0dec0dec0000001, 0xc0dec0dec0000010, 0xc0dec0dec0000002, 0xc0dec0dec0000100, 0xc0dec0dec0001000}
                	            	actual  : []uint64{0xc0dec0dec040b2b8}
                	            	
                	            	Diff:
                	            	--- Expected
                	            	+++ Actual
                	            	@@ -1,7 +1,3 @@
                	            	-([]uint64) (len=5) {
                	            	- (uint64) 13897757563048427521,
                	            	- (uint64) 13897757563048427536,
                	            	- (uint64) 13897757563048427522,
                	            	- (uint64) 13897757563048427776,
                	            	- (uint64) 13897757563048431616
                	            	+([]uint64) (len=1) {
                	            	+ (uint64) 13897757563052667576
                	            	 }
                	Test:       	TestCover/64_fork/13
            run_test.go:433: 
                	Error Trace:	/syzkaller/gopath/src/github.com/google/syzkaller/pkg/runtest/run_test.go:433
                	            				/syzkaller/gopath/src/github.com/google/syzkaller/pkg/runtest/run_test.go:389
                	Error:      	Not equal: 
                	            	expected: []uint64{0xc0dec0dec0001100, 0xc0dec0dec0000102}
                	            	actual  : []uint64{0xc0dec0dec040b2b8}
                	            	
                	            	Diff:
                	            	--- Expected
                	            	+++ Actual
                	            	@@ -1,4 +1,3 @@
                	            	-([]uint64) (len=2) {
                	            	- (uint64) 13897757563048431872,
                	            	- (uint64) 13897757563048427778
                	            	+([]uint64) (len=1) {
                	            	+ (uint64) 13897757563052667576
                	            	 }
                	Test:       	TestCover/64_fork/13
        --- FAIL: TestCover/64_fork/9 (0.45s)
            run_test.go:432: 
                	Error Trace:	/syzkaller/gopath/src/github.com/google/syzkaller/pkg/runtest/run_test.go:432
                	            				/syzkaller/gopath/src/github.com/google/syzkaller/pkg/runtest/run_test.go:389
                	Error:      	Not equal: 
                	            	expected: []uint64{}
                	            	actual  : []uint64{0xc0dec0dec040b2b8}
                	            	
                	            	Diff:
                	            	--- Expected
                	            	+++ Actual
                	            	@@ -1,2 +1,3 @@
                	            	-([]uint64) {
                	            	+([]uint64) (len=1) {
                	            	+ (uint64) 13897757563052667576
                	            	 }
                	Test:       	TestCover/64_fork/9
            run_test.go:433: 
                	Error Trace:	/syzkaller/gopath/src/github.com/google/syzkaller/pkg/runtest/run_test.go:433
                	            				/syzkaller/gopath/src/github.com/google/syzkaller/pkg/runtest/run_test.go:389
                	Error:      	Not equal: 
                	            	expected: []uint64{}
                	            	actual  : []uint64{0xc0dec0dec040b2b8}
                	            	
                	            	Diff:
                	            	--- Expected
                	            	+++ Actual
                	            	@@ -1,2 +1,3 @@
                	            	-([]uint64) {
                	            	+([]uint64) (len=1) {
                	            	+ (uint64) 13897757563052667576
                	            	 }
                	Test:       	TestCover/64_fork/9
        --- FAIL: TestCover/64_fork/6 (0.46s)
            run_test.go:432: 
                	Error Trace:	/syzkaller/gopath/src/github.com/google/syzkaller/pkg/runtest/run_test.go:432
                	            				/syzkaller/gopath/src/github.com/google/syzkaller/pkg/runtest/run_test.go:389
                	Error:      	Not equal: 
                	            	expected: []uint64{0xc0dec0dec0000033, 0xc0dec0dec0000022, 0xc0dec0dec0000011, 0xc0dec0dec0000011, 0xc0dec0dec0000022, 0xc0dec0dec0000033, 0xc0dec0dec0000011}
                	            	actual  : []uint64{0xc0dec0dec040b2b8}
                	            	
                	            	Diff:
                	            	--- Expected
                	            	+++ Actual
                	            	@@ -1,9 +1,3 @@
                	            	-([]uint64) (len=7) {
                	            	- (uint64) 13897757563048427571,
                	            	- (uint64) 13897757563048427554,
                	            	- (uint64) 13897757563048427537,
                	            	- (uint64) 13897757563048427537,
                	            	- (uint64) 13897757563048427554,
                	            	- (uint64) 13897757563048427571,
                	            	- (uint64) 13897757563048427537
                	            	+([]uint64) (len=1) {
                	            	+ (uint64) 13897757563052667576
                	            	 }
                	Test:       	TestCover/64_fork/6
        --- FAIL: TestCover/64_fork/0 (0.47s)
            run_test.go:432: 
                	Error Trace:	/syzkaller/gopath/src/github.com/google/syzkaller/pkg/runtest/run_test.go:432
                	            				/syzkaller/gopath/src/github.com/google/syzkaller/pkg/runtest/run_test.go:389
                	Error:      	Not equal: 
                	            	expected: []uint64{}
                	            	actual  : []uint64{0xc0dec0dec040b2b8}
                	            	
                	            	Diff:
                	            	--- Expected
                	            	+++ Actual
                	            	@@ -1,2 +1,3 @@
                	            	-([]uint64) {
                	            	+([]uint64) (len=1) {
                	            	+ (uint64) 13897757563052667576
                	            	 }
                	Test:       	TestCover/64_fork/0
            run_test.go:433: 
                	Error Trace:	/syzkaller/gopath/src/github.com/google/syzkaller/pkg/runtest/run_test.go:433
                	            				/syzkaller/gopath/src/github.com/google/syzkaller/pkg/runtest/run_test.go:389
                	Error:      	Not equal: 
                	            	expected: []uint64{}
                	            	actual  : []uint64{0xc0dec0dec040b2b8}
                	            	
                	            	Diff:
                	            	--- Expected
                	            	+++ Actual
                	            	@@ -1,2 +1,3 @@
                	            	-([]uint64) {
                	            	+([]uint64) (len=1) {
                	            	+ (uint64) 13897757563052667576
                	            	 }
                	Test:       	TestCover/64_fork/0
        --- FAIL: TestCover/64_fork/7 (0.49s)
            run_test.go:432: 
                	Error Trace:	/syzkaller/gopath/src/github.com/google/syzkaller/pkg/runtest/run_test.go:432
                	            				/syzkaller/gopath/src/github.com/google/syzkaller/pkg/runtest/run_test.go:389
                	Error:      	Not equal: 
                	            	expected: []uint64{0xc0dec0dec0000011, 0xc0dec0dec0000022, 0xc0dec0dec0000033}
                	            	actual  : []uint64{0xc0dec0dec040b2b8}
                	            	
                	            	Diff:
                	            	--- Expected
                	            	+++ Actual
                	            	@@ -1,5 +1,3 @@
                	            	-([]uint64) (len=3) {
                	            	- (uint64) 13897757563048427537,
                	            	- (uint64) 13897757563048427554,
                	            	- (uint64) 13897757563048427571
                	            	+([]uint64) (len=1) {
                	            	+ (uint64) 13897757563052667576
                	            	 }
                	Test:       	TestCover/64_fork/7
        --- FAIL: TestCover/64_fork/11 (0.52s)
            run_test.go:435: 
                	Error Trace:	/syzkaller/gopath/src/github.com/google/syzkaller/pkg/runtest/run_test.go:435
                	            				/syzkaller/gopath/src/github.com/google/syzkaller/pkg/runtest/run_test.go:389
                	Error:      	elements differ
                	            	
                	            	extra elements in list A:
                	            	([]interface {}) (len=8) {
                	            	 (*flatrpc.ComparisonRawT)({
                	            	  Pc: (uint64) 1,
                	            	  Op1: (uint64) 2459565876494606882,
                	            	  Op2: (uint64) 1229782938247303441,
                	            	  IsConst: (bool) true
                	            	 }),
                	            	 (*flatrpc.ComparisonRawT)({
                	            	  Pc: (uint64) 1,
                	            	  Op1: (uint64) 49,
                	            	  Op2: (uint64) 48,
                	            	  IsConst: (bool) false
                	            	 }),
                	            	 (*flatrpc.ComparisonRawT)({
                	            	  Pc: (uint64) 1,
                	            	  Op1: (uint64) 119,
                	            	  Op2: (uint64) 18446744073709551523,
                	            	  IsConst: (bool) true
                	            	 }),
                	            	 (*flatrpc.ComparisonRawT)({
                	            	  Pc: (uint64) 1,
                	            	  Op1: (uint64) 18446744073709551585,
                	            	  Op2: (uint64) 16,
                	            	  IsConst: (bool) true
                	            	 }),
                	            	 (*flatrpc.ComparisonRawT)({
                	            	  Pc: (uint64) 1,
                	            	  Op1: (uint64) 17185,
                	            	  Op2: (uint64) 18446744073709530061,
                	            	  IsConst: (bool) true
                	            	 }),
                	            	 (*flatrpc.ComparisonRawT)({
                	            	  Pc: (uint64) 1,
                	            	  Op1: (uint64) 17185,
                	            	  Op2: (uint64) 18446744072296927796,
                	            	  IsConst: (bool) true
                	            	 }),
                	            	 (*flatrpc.ComparisonRawT)({
                	            	  Pc: (uint64) 1,
                	            	  Op1: (uint64) 13107,
                	            	  Op2: (uint64) 0,
                	            	  IsConst: (bool) false
                	            	 }),
                	            	 (*flatrpc.ComparisonRawT)({
                	            	  Pc: (uint64) 1,
                	            	  Op1: (uint64) 43981,
                	            	  Op2: (uint64) 3659137040,
                	            	  IsConst: (bool) true
                	            	 })
                	            	}
                	            	
                	            	
                	            	listA:
                	            	([]*flatrpc.ComparisonRawT) (len=8) {
                	            	 (*flatrpc.ComparisonRawT)({
                	            	  Pc: (uint64) 1,
                	            	  Op1: (uint64) 2459565876494606882,
                	            	  Op2: (uint64) 1229782938247303441,
                	            	  IsConst: (bool) true
                	            	 }),
                	            	 (*flatrpc.ComparisonRawT)({
                	            	  Pc: (uint64) 1,
                	            	  Op1: (uint64) 49,
                	            	  Op2: (uint64) 48,
                	            	  IsConst: (bool) false
                	            	 }),
                	            	 (*flatrpc.ComparisonRawT)({
                	            	  Pc: (uint64) 1,
                	            	  Op1: (uint64) 119,
                	            	  Op2: (uint64) 18446744073709551523,
                	            	  IsConst: (bool) true
                	            	 }),
                	            	 (*flatrpc.ComparisonRawT)({
                	            	  Pc: (uint64) 1,
                	            	  Op1: (uint64) 18446744073709551585,
                	            	  Op2: (uint64) 16,
                	            	  IsConst: (bool) true
                	            	 }),
                	            	 (*flatrpc.ComparisonRawT)({
                	            	  Pc: (uint64) 1,
                	            	  Op1: (uint64) 17185,
                	            	  Op2: (uint64) 18446744073709530061,
                	            	  IsConst: (bool) true
                	            	 }),
                	            	 (*flatrpc.ComparisonRawT)({
                	            	  Pc: (uint64) 1,
                	            	  Op1: (uint64) 17185,
                	            	  Op2: (uint64) 18446744072296927796,
                	            	  IsConst: (bool) true
                	            	 }),
                	            	 (*flatrpc.ComparisonRawT)({
                	            	  Pc: (uint64) 1,
                	            	  Op1: (uint64) 13107,
                	            	  Op2: (uint64) 0,
                	            	  IsConst: (bool) false
                	            	 }),
                	            	 (*flatrpc.ComparisonRawT)({
                	            	  Pc: (uint64) 1,
                	            	  Op1: (uint64) 43981,
                	            	  Op2: (uint64) 3659137040,
                	            	  IsConst: (bool) true
                	            	 })
                	            	}
                	            	
                	            	
                	            	listB:
                	            	([]*flatrpc.ComparisonRawT) {
                	            	}
                	Test:       	TestCover/64_fork/11
        --- FAIL: TestCover/64_fork/18 (5.62s)
            run_test.go:423: got no extra coverage info
    --- FAIL: TestCover/64 (10.92s)
        --- FAIL: TestCover/64/16 (0.39s)
            run_test.go:432: 
                	Error Trace:	/syzkaller/gopath/src/github.com/google/syzkaller/pkg/runtest/run_test.go:432
                	            				/syzkaller/gopath/src/github.com/google/syzkaller/pkg/runtest/run_test.go:389
                	Error:      	Not equal: 
                	            	expected: []uint64{0xc0dec0dec0000001, 0xc0dec0dec0000010, 0xc0dec0dec0000020, 0xc0dec0dec0000040, 0xc0dec0dec0000100, 0xc0dec0dec0001000, 0xc0dec0dec0002000}
                	            	actual  : []uint64{0xc0dec0dec040ab20}
                	            	
                	            	Diff:
                	            	--- Expected
                	            	+++ Actual
                	            	@@ -1,9 +1,3 @@
                	            	-([]uint64) (len=7) {
                	            	- (uint64) 13897757563048427521,
                	            	- (uint64) 13897757563048427536,
                	            	- (uint64) 13897757563048427552,
                	            	- (uint64) 13897757563048427584,
                	            	- (uint64) 13897757563048427776,
                	            	- (uint64) 13897757563048431616,
                	            	- (uint64) 13897757563048435712
                	            	+([]uint64) (len=1) {
                	            	+ (uint64) 13897757563052665632
                	            	 }
                	Test:       	TestCover/64/16
            run_test.go:433: 
                	Error Trace:	/syzkaller/gopath/src/github.com/google/syzkaller/pkg/runtest/run_test.go:433
                	            				/syzkaller/gopath/src/github.com/google/syzkaller/pkg/runtest/run_test.go:389
                	Error:      	Not equal: 
                	            	expected: []uint64{0xc0dec0dec0001100, 0xc0dec0dec0000140, 0xc0dec0dec0000011, 0xc0dec0dec0000001}
                	            	actual  : []uint64{0xc0dec0dec040ab20}
                	            	
                	            	Diff:
                	            	--- Expected
                	            	+++ Actual
                	            	@@ -1,6 +1,3 @@
                	            	-([]uint64) (len=4) {
                	            	- (uint64) 13897757563048431872,
                	            	- (uint64) 13897757563048427840,
                	            	- (uint64) 13897757563048427537,
                	            	- (uint64) 13897757563048427521
                	            	+([]uint64) (len=1) {
                	            	+ (uint64) 13897757563052665632
                	            	 }
                	Test:       	TestCover/64/16
        --- FAIL: TestCover/64/6 (0.41s)
            run_test.go:432: 
                	Error Trace:	/syzkaller/gopath/src/github.com/google/syzkaller/pkg/runtest/run_test.go:432
                	            				/syzkaller/gopath/src/github.com/google/syzkaller/pkg/runtest/run_test.go:389
                	Error:      	Not equal: 
                	            	expected: []uint64{0xc0dec0dec0000033, 0xc0dec0dec0000022, 0xc0dec0dec0000011, 0xc0dec0dec0000011, 0xc0dec0dec0000022, 0xc0dec0dec0000033, 0xc0dec0dec0000011}
                	            	actual  : []uint64{0xc0dec0dec040ab20}
                	            	
                	            	Diff:
                	            	--- Expected
                	            	+++ Actual
                	            	@@ -1,9 +1,3 @@
                	            	-([]uint64) (len=7) {
                	            	- (uint64) 13897757563048427571,
                	            	- (uint64) 13897757563048427554,
                	            	- (uint64) 13897757563048427537,
                	            	- (uint64) 13897757563048427537,
                	            	- (uint64) 13897757563048427554,
                	            	- (uint64) 13897757563048427571,
                	            	- (uint64) 13897757563048427537
                	            	+([]uint64) (len=1) {
                	            	+ (uint64) 13897757563052665632
                	            	 }
                	Test:       	TestCover/64/6
        --- FAIL: TestCover/64/11 (0.53s)
            run_test.go:435: 
                	Error Trace:	/syzkaller/gopath/src/github.com/google/syzkaller/pkg/runtest/run_test.go:435
                	            				/syzkaller/gopath/src/github.com/google/syzkaller/pkg/runtest/run_test.go:389
                	Error:      	elements differ
                	            	
                	            	extra elements in list A:
                	            	([]interface {}) (len=8) {
                	            	 (*flatrpc.ComparisonRawT)({
                	            	  Pc: (uint64) 1,
                	            	  Op1: (uint64) 2459565876494606882,
                	            	  Op2: (uint64) 1229782938247303441,
                	            	  IsConst: (bool) true
                	            	 }),
                	            	 (*flatrpc.ComparisonRawT)({
                	            	  Pc: (uint64) 1,
                	            	  Op1: (uint64) 49,
                	            	  Op2: (uint64) 48,
                	            	  IsConst: (bool) false
                	            	 }),
                	            	 (*flatrpc.ComparisonRawT)({
                	            	  Pc: (uint64) 1,
                	            	  Op1: (uint64) 119,
                	            	  Op2: (uint64) 18446744073709551523,
                	            	  IsConst: (bool) true
                	            	 }),
                	            	 (*flatrpc.ComparisonRawT)({
                	            	  Pc: (uint64) 1,
                	            	  Op1: (uint64) 18446744073709551585,
                	            	  Op2: (uint64) 16,
                	            	  IsConst: (bool) true
                	            	 }),
                	            	 (*flatrpc.ComparisonRawT)({
                	            	  Pc: (uint64) 1,
                	            	  Op1: (uint64) 17185,
                	            	  Op2: (uint64) 18446744073709530061,
                	            	  IsConst: (bool) true
                	            	 }),
                	            	 (*flatrpc.ComparisonRawT)({
                	            	  Pc: (uint64) 1,
                	            	  Op1: (uint64) 17185,
                	            	  Op2: (uint64) 18446744072296927796,
                	            	  IsConst: (bool) true
                	            	 }),
                	            	 (*flatrpc.ComparisonRawT)({
                	            	  Pc: (uint64) 1,
                	            	  Op1: (uint64) 13107,
                	            	  Op2: (uint64) 0,
                	            	  IsConst: (bool) false
                	            	 }),
                	            	 (*flatrpc.ComparisonRawT)({
                	            	  Pc: (uint64) 1,
                	            	  Op1: (uint64) 43981,
                	            	  Op2: (uint64) 3659137040,
                	            	  IsConst: (bool) true
                	            	 })
                	            	}
                	            	
                	            	
                	            	listA:
                	            	([]*flatrpc.ComparisonRawT) (len=8) {
                	            	 (*flatrpc.ComparisonRawT)({
                	            	  Pc: (uint64) 1,
                	            	  Op1: (uint64) 2459565876494606882,
                	            	  Op2: (uint64) 1229782938247303441,
                	            	  IsConst: (bool) true
                	            	 }),
                	            	 (*flatrpc.ComparisonRawT)({
                	            	  Pc: (uint64) 1,
                	            	  Op1: (uint64) 49,
                	            	  Op2: (uint64) 48,
                	            	  IsConst: (bool) false
                	            	 }),
                	            	 (*flatrpc.ComparisonRawT)({
                	            	  Pc: (uint64) 1,
                	            	  Op1: (uint64) 119,
                	            	  Op2: (uint64) 18446744073709551523,
                	            	  IsConst: (bool) true
                	            	 }),
                	            	 (*flatrpc.ComparisonRawT)({
                	            	  Pc: (uint64) 1,
                	            	  Op1: (uint64) 18446744073709551585,
                	            	  Op2: (uint64) 16,
                	            	  IsConst: (bool) true
                	            	 }),
                	            	 (*flatrpc.ComparisonRawT)({
                	            	  Pc: (uint64) 1,
                	            	  Op1: (uint64) 17185,
                	            	  Op2: (uint64) 18446744073709530061,
                	            	  IsConst: (bool) true
                	            	 }),
                	            	 (*flatrpc.ComparisonRawT)({
                	            	  Pc: (uint64) 1,
                	            	  Op1: (uint64) 17185,
                	            	  Op2: (uint64) 18446744072296927796,
                	            	  IsConst: (bool) true
                	            	 }),
                	            	 (*flatrpc.ComparisonRawT)({
                	            	  Pc: (uint64) 1,
                	            	  Op1: (uint64) 13107,
                	            	  Op2: (uint64) 0,
                	            	  IsConst: (bool) false
                	            	 }),
                	            	 (*flatrpc.ComparisonRawT)({
                	            	  Pc: (uint64) 1,
                	            	  Op1: (uint64) 43981,
                	            	  Op2: (uint64) 3659137040,
                	            	  IsConst: (bool) true
                	            	 })
                	            	}
                	            	
                	            	
                	            	listB:
                	            	([]*flatrpc.ComparisonRawT) {
                	            	}
                	Test:       	TestCover/64/11
        --- FAIL: TestCover/64/9 (0.53s)
            run_test.go:432: 
                	Error Trace:	/syzkaller/gopath/src/github.com/google/syzkaller/pkg/runtest/run_test.go:432
                	            				/syzkaller/gopath/src/github.com/google/syzkaller/pkg/runtest/run_test.go:389
                	Error:      	Not equal: 
                	            	expected: []uint64{}
                	            	actual  : []uint64{0xc0dec0dec040ab20}
                	            	
                	            	Diff:
                	            	--- Expected
                	            	+++ Actual
                	            	@@ -1,2 +1,3 @@
                	            	-([]uint64) {
                	            	+([]uint64) (len=1) {
                	            	+ (uint64) 13897757563052665632
                	            	 }
                	Test:       	TestCover/64/9
            run_test.go:433: 
                	Error Trace:	/syzkaller/gopath/src/github.com/google/syzkaller/pkg/runtest/run_test.go:433
                	            				/syzkaller/gopath/src/github.com/google/syzkaller/pkg/runtest/run_test.go:389
                	Error:      	Not equal: 
                	            	expected: []uint64{}
                	            	actual  : []uint64{0xc0dec0dec040ab20}
                	            	
                	            	Diff:
                	            	--- Expected
                	            	+++ Actual
                	            	@@ -1,2 +1,3 @@
                	            	-([]uint64) {
                	            	+([]uint64) (len=1) {
                	            	+ (uint64) 13897757563052665632
                	            	 }
                	Test:       	TestCover/64/9
        --- FAIL: TestCover/64/2 (0.53s)
            run_test.go:432: 
                	Error Trace:	/syzkaller/gopath/src/github.com/google/syzkaller/pkg/runtest/run_test.go:432
                	            				/syzkaller/gopath/src/github.com/google/syzkaller/pkg/runtest/run_test.go:389
                	Error:      	Not equal: 
                	            	expected: []uint64{0xc0dec0dec0112233}
                	            	actual  : []uint64{0xc0dec0dec040ab20}
                	            	
                	            	Diff:
                	            	--- Expected
                	            	+++ Actual
                	            	@@ -1,3 +1,3 @@
                	            	 ([]uint64) (len=1) {
                	            	- (uint64) 13897757563049550387
                	            	+ (uint64) 13897757563052665632
                	            	 }
                	Test:       	TestCover/64/2
            run_test.go:433: 
                	Error Trace:	/syzkaller/gopath/src/github.com/google/syzkaller/pkg/runtest/run_test.go:433
                	            				/syzkaller/gopath/src/github.com/google/syzkaller/pkg/runtest/run_test.go:389
                	Error:      	Not equal: 
                	            	expected: []uint64{0xc0dec0dec0112233}
                	            	actual  : []uint64{0xc0dec0dec040ab20}
                	            	
                	            	Diff:
                	            	--- Expected
                	            	+++ Actual
                	            	@@ -1,3 +1,3 @@
                	            	 ([]uint64) (len=1) {
                	            	- (uint64) 13897757563049550387
                	            	+ (uint64) 13897757563052665632
                	            	 }
                	Test:       	TestCover/64/2
        --- FAIL: TestCover/64/4 (0.53s)
            run_test.go:432: 
                	Error Trace:	/syzkaller/gopath/src/github.com/google/syzkaller/pkg/runtest/run_test.go:432
                	            				/syzkaller/gopath/src/github.com/google/syzkaller/pkg/runtest/run_test.go:389
                	Error:      	Not equal: 
                	            	expected: []uint64{0xc0dec0dec0112233}
                	            	actual  : []uint64{0xc0dec0dec040ab20}
                	            	
                	            	Diff:
                	            	--- Expected
                	            	+++ Actual
                	            	@@ -1,3 +1,3 @@
                	            	 ([]uint64) (len=1) {
                	            	- (uint64) 13897757563049550387
                	            	+ (uint64) 13897757563052665632
                	            	 }
                	Test:       	TestCover/64/4
        --- FAIL: TestCover/64/5 (0.58s)
            run_test.go:433: 
                	Error Trace:	/syzkaller/gopath/src/github.com/google/syzkaller/pkg/runtest/run_test.go:433
                	            				/syzkaller/gopath/src/github.com/google/syzkaller/pkg/runtest/run_test.go:389
                	Error:      	Not equal: 
                	            	expected: []uint64{0xc0dec0dec0112233}
                	            	actual  : []uint64{0xc0dec0dec040ab20}
                	            	
                	            	Diff:
                	            	--- Expected
                	            	+++ Actual
                	            	@@ -1,3 +1,3 @@
                	            	 ([]uint64) (len=1) {
                	            	- (uint64) 13897757563049550387
                	            	+ (uint64) 13897757563052665632
                	            	 }
                	Test:       	TestCover/64/5
        --- FAIL: TestCover/64/8 (0.58s)
            run_test.go:433: 
                	Error Trace:	/syzkaller/gopath/src/github.com/google/syzkaller/pkg/runtest/run_test.go:433
                	            				/syzkaller/gopath/src/github.com/google/syzkaller/pkg/runtest/run_test.go:389
                	Error:      	Not equal: 
                	            	expected: []uint64{0xc0dec0dec0011b01, 0xc0dec0dec0044bf0, 0xc0dec0dec00330f2, 0xc0dec0dec0022003, 0xc0dec0dec0011001}
                	            	actual  : []uint64{0xc0dec0dec040ab20}
                	            	
                	            	Diff:
                	            	--- Expected
                	            	+++ Actual
                	            	@@ -1,7 +1,3 @@
                	            	-([]uint64) (len=5) {
                	            	- (uint64) 13897757563048499969,
                	            	- (uint64) 13897757563048709104,
                	            	- (uint64) 13897757563048636658,
                	            	- (uint64) 13897757563048566787,
                	            	- (uint64) 13897757563048497153
                	            	+([]uint64) (len=1) {
                	            	+ (uint64) 13897757563052665632
                	            	 }
                	Test:       	TestCover/64/8
        --- FAIL: TestCover/64/13 (0.59s)
            run_test.go:432: 
                	Error Trace:	/syzkaller/gopath/src/github.com/google/syzkaller/pkg/runtest/run_test.go:432
                	            				/syzkaller/gopath/src/github.com/google/syzkaller/pkg/runtest/run_test.go:389
                	Error:      	Not equal: 
                	            	expected: []uint64{0xc0dec0dec0000001, 0xc0dec0dec0000010, 0xc0dec0dec0000002, 0xc0dec0dec0000100, 0xc0dec0dec0001000}
                	            	actual  : []uint64{0xc0dec0dec040ab20}
                	            	
                	            	Diff:
                	            	--- Expected
                	            	+++ Actual
                	            	@@ -1,7 +1,3 @@
                	            	-([]uint64) (len=5) {
                	            	- (uint64) 13897757563048427521,
                	            	- (uint64) 13897757563048427536,
                	            	- (uint64) 13897757563048427522,
                	            	- (uint64) 13897757563048427776,
                	            	- (uint64) 13897757563048431616
                	            	+([]uint64) (len=1) {
                	            	+ (uint64) 13897757563052665632
                	            	 }
                	Test:       	TestCover/64/13
            run_test.go:433: 
                	Error Trace:	/syzkaller/gopath/src/github.com/google/syzkaller/pkg/runtest/run_test.go:433
                	            				/syzkaller/gopath/src/github.com/google/syzkaller/pkg/runtest/run_test.go:389
                	Error:      	Not equal: 
                	            	expected: []uint64{0xc0dec0dec0001100, 0xc0dec0dec0000102}
                	            	actual  : []uint64{0xc0dec0dec040ab20}
                	            	
                	            	Diff:
                	            	--- Expected
                	            	+++ Actual
                	            	@@ -1,4 +1,3 @@
                	            	-([]uint64) (len=2) {
                	            	- (uint64) 13897757563048431872,
                	            	- (uint64) 13897757563048427778
                	            	+([]uint64) (len=1) {
                	            	+ (uint64) 13897757563052665632
                	            	 }
                	Test:       	TestCover/64/13
        --- FAIL: TestCover/64/15 (0.59s)
            run_test.go:433: 
                	Error Trace:	/syzkaller/gopath/src/github.com/google/syzkaller/pkg/runtest/run_test.go:433
                	            				/syzkaller/gopath/src/github.com/google/syzkaller/pkg/runtest/run_test.go:389
                	Error:      	Not equal: 
                	            	expected: []uint64{0xc0dec0dec0001100, 0xc0dec0dec0000102, 0xc0dec0dec0000012, 0xc0dec0dec0000011, 0xc0dec0dec0000001}
                	            	actual  : []uint64{0xc0dec0dec040ab20}
                	            	
                	            	Diff:
                	            	--- Expected
                	            	+++ Actual
                	            	@@ -1,7 +1,3 @@
                	            	-([]uint64) (len=5) {
                	            	- (uint64) 13897757563048431872,
                	            	- (uint64) 13897757563048427778,
                	            	- (uint64) 13897757563048427538,
                	            	- (uint64) 13897757563048427537,
                	            	- (uint64) 13897757563048427521
                	            	+([]uint64) (len=1) {
                	            	+ (uint64) 13897757563052665632
                	            	 }
                	Test:       	TestCover/64/15
        --- FAIL: TestCover/64/7 (0.59s)
            run_test.go:432: 
                	Error Trace:	/syzkaller/gopath/src/github.com/google/syzkaller/pkg/runtest/run_test.go:432
                	            				/syzkaller/gopath/src/github.com/google/syzkaller/pkg/runtest/run_test.go:389
                	Error:      	Not equal: 
                	            	expected: []uint64{0xc0dec0dec0000011, 0xc0dec0dec0000022, 0xc0dec0dec0000033}
                	            	actual  : []uint64{0xc0dec0dec040ab20}
                	            	
                	            	Diff:
                	            	--- Expected
                	            	+++ Actual
                	            	@@ -1,5 +1,3 @@
                	            	-([]uint64) (len=3) {
                	            	- (uint64) 13897757563048427537,
                	            	- (uint64) 13897757563048427554,
                	            	- (uint64) 13897757563048427571
                	            	+([]uint64) (len=1) {
                	            	+ (uint64) 13897757563052665632
                	            	 }
                	Test:       	TestCover/64/7
        --- FAIL: TestCover/64/0 (0.62s)
            run_test.go:432: 
                	Error Trace:	/syzkaller/gopath/src/github.com/google/syzkaller/pkg/runtest/run_test.go:432
                	            				/syzkaller/gopath/src/github.com/google/syzkaller/pkg/runtest/run_test.go:389
                	Error:      	Not equal: 
                	            	expected: []uint64{}
                	            	actual  : []uint64{0xc0dec0dec040ab20}
                	            	
                	            	Diff:
                	            	--- Expected
                	            	+++ Actual
                	            	@@ -1,2 +1,3 @@
                	            	-([]uint64) {
                	            	+([]uint64) (len=1) {
                	            	+ (uint64) 13897757563052665632
                	            	 }
                	Test:       	TestCover/64/0
            run_test.go:433: 
                	Error Trace:	/syzkaller/gopath/src/github.com/google/syzkaller/pkg/runtest/run_test.go:433
                	            				/syzkaller/gopath/src/github.com/google/syzkaller/pkg/runtest/run_test.go:389
                	Error:      	Not equal: 
                	            	expected: []uint64{}
                	            	actual  : []uint64{0xc0dec0dec040ab20}
                	            	
                	            	Diff:
                	            	--- Expected
                	            	+++ Actual
                	            	@@ -1,2 +1,3 @@
                	            	-([]uint64) {
                	            	+([]uint64) (len=1) {
                	            	+ (uint64) 13897757563052665632
                	            	 }
                	Test:       	TestCover/64/0
        --- FAIL: TestCover/64/18 (5.62s)
            run_test.go:423: got no extra coverage info
panic: test timed out after 10m0s
	running tests:
		TestExecutorCommonExt (9m12s)

goroutine 5447 [running]:
testing.(*M).startAlarm.func1()
	/syzkaller/gopath/pkg/mod/golang.org/toolchain@v0.0.1-go1.23.6.linux-arm64/src/testing/testing.go:2373 +0x30c
created by time.goFunc
	/syzkaller/gopath/pkg/mod/golang.org/toolchain@v0.0.1-go1.23.6.linux-arm64/src/time/sleep.go:215 +0x38

goroutine 1 [chan receive, 8 minutes]:
testing.tRunner.func1()
	/syzkaller/gopath/pkg/mod/golang.org/toolchain@v0.0.1-go1.23.6.linux-arm64/src/testing/testing.go:1651 +0x434
testing.tRunner(0x40001d9ba0, 0x4000efbc68)
	/syzkaller/gopath/pkg/mod/golang.org/toolchain@v0.0.1-go1.23.6.linux-arm64/src/testing/testing.go:1696 +0x120
testing.runTests(0x40010357d0, {0x371bc20, 0x6, 0x6}, {0x8500000000000000?, 0x85101cdac4610fdd?, 0x37c18c0?})
	/syzkaller/gopath/pkg/mod/golang.org/toolchain@v0.0.1-go1.23.6.linux-arm64/src/testing/testing.go:2166 +0x3ac
testing.(*M).Run(0x40012d2be0)
	/syzkaller/gopath/pkg/mod/golang.org/toolchain@v0.0.1-go1.23.6.linux-arm64/src/testing/testing.go:2034 +0x588
main.main()
	_testmain.go:55 +0x90

goroutine 67 [select]:
go.opencensus.io/stats/view.(*worker).start(0x40001dd880)
	/syzkaller/gopath/pkg/mod/go.opencensus.io@v0.24.0/stats/view/worker.go:292 +0x88
created by go.opencensus.io/stats/view.init.0 in goroutine 1
	/syzkaller/gopath/pkg/mod/go.opencensus.io@v0.24.0/stats/view/worker.go:34 +0x98

goroutine 7 [chan receive]:
github.com/google/syzkaller/pkg/stat.newSet.func1()
	/syzkaller/gopath/src/github.com/google/syzkaller/pkg/stat/set.go:95 +0x5c
created by github.com/google/syzkaller/pkg/stat.newSet in goroutine 1
	/syzkaller/gopath/src/github.com/google/syzkaller/pkg/stat/set.go:94 +0xcc

goroutine 203 [select, 8 minutes]:
github.com/google/syzkaller/pkg/fuzzer/queue.(*Request).Wait(0x40213d2c00, {0x2619e18, 0x37e9c80})
	/syzkaller/gopath/src/github.com/google/syzkaller/pkg/fuzzer/queue/queue.go:102 +0x6c
github.com/google/syzkaller/pkg/runtest.TestExecutorCommonExt(0x40013a01a0)
	/syzkaller/gopath/src/github.com/google/syzkaller/pkg/runtest/executor_test.go:174 +0x240
testing.tRunner(0x40013a01a0, 0x242bda0)
	/syzkaller/gopath/pkg/mod/golang.org/toolchain@v0.0.1-go1.23.6.linux-arm64/src/testing/testing.go:1690 +0xe4
created by testing.(*T).Run in goroutine 1
	/syzkaller/gopath/pkg/mod/golang.org/toolchain@v0.0.1-go1.23.6.linux-arm64/src/testing/testing.go:1743 +0x314

goroutine 5481 [chan send, 8 minutes]:
github.com/google/syzkaller/pkg/runtest.startRPCServer.func2()
	/syzkaller/gopath/src/github.com/google/syzkaller/pkg/runtest/run_test.go:518 +0x68
created by github.com/google/syzkaller/pkg/runtest.startRPCServer in goroutine 203
	/syzkaller/gopath/src/github.com/google/syzkaller/pkg/runtest/run_test.go:515 +0x370
FAIL	github.com/google/syzkaller/pkg/runtest	611.543s
ok  	github.com/google/syzkaller/pkg/serializer	(cached)
ok  	github.com/google/syzkaller/pkg/signal	(cached)
ok  	github.com/google/syzkaller/pkg/stat	(cached)
ok  	github.com/google/syzkaller/pkg/stat/sample	(cached)
ok  	github.com/google/syzkaller/pkg/subsystem	(cached)
ok  	github.com/google/syzkaller/pkg/subsystem/linux	(cached)
ok  	github.com/google/syzkaller/pkg/subsystem/lists	(cached)
ok  	github.com/google/syzkaller/pkg/symbolizer	(cached)
ok  	github.com/google/syzkaller/pkg/tool	(cached)
ok  	github.com/google/syzkaller/pkg/validator	(cached)
ok  	github.com/google/syzkaller/pkg/vcs	(cached)
ok  	github.com/google/syzkaller/pkg/vminfo	23.839s
ok  	github.com/google/syzkaller/prog	68.786s
ok  	github.com/google/syzkaller/prog/test	12.980s
ok  	github.com/google/syzkaller/sys/linux	15.314s
ok  	github.com/google/syzkaller/sys/netbsd	10.961s
ok  	github.com/google/syzkaller/sys/openbsd	13.649s
ok  	github.com/google/syzkaller/syz-ci	18.367s
ok  	github.com/google/syzkaller/syz-cluster/controller	(cached)
ok  	github.com/google/syzkaller/syz-cluster/pkg/blob	(cached)
ok  	github.com/google/syzkaller/syz-cluster/pkg/controller	(cached)
ok  	github.com/google/syzkaller/syz-cluster/pkg/db	(cached)
ok  	github.com/google/syzkaller/syz-cluster/pkg/report	(cached)
ok  	github.com/google/syzkaller/syz-cluster/pkg/triage	(cached)
ok  	github.com/google/syzkaller/syz-cluster/reporter	(cached)
ok  	github.com/google/syzkaller/syz-cluster/series-tracker	(cached)
ok  	github.com/google/syzkaller/syz-cluster/workflow/fuzz-step	13.466s
ok  	github.com/google/syzkaller/syz-hub	(cached)
ok  	github.com/google/syzkaller/syz-hub/state	(cached)
ok  	github.com/google/syzkaller/syz-manager	12.443s
ok  	github.com/google/syzkaller/tools/syz-db	10.720s
ok  	github.com/google/syzkaller/tools/syz-declextract	9.967s
ok  	github.com/google/syzkaller/tools/syz-kconf	(cached)
ok  	github.com/google/syzkaller/tools/syz-linter	(cached)
ok  	github.com/google/syzkaller/tools/syz-testbed	10.638s
ok  	github.com/google/syzkaller/tools/syz-trace2syz/parser	8.907s
ok  	github.com/google/syzkaller/tools/syz-trace2syz/proggen	12.444s
ok  	github.com/google/syzkaller/vm	18.348s
ok  	github.com/google/syzkaller/vm/dispatcher	(cached)
ok  	github.com/google/syzkaller/vm/isolated	9.485s
ok  	github.com/google/syzkaller/vm/proxyapp	12.400s
ok  	github.com/google/syzkaller/vm/vmimpl	8.070s
FAIL