ERROR: runsc/BUILD:36:10: GoLink runsc/runsc-race_/runsc-race failed: (Exit 1): builder failed: error executing command (from target //runsc:runsc-race) 
ld.lld: error: undefined symbol: __res_search
collect2: error: ld returned 1 exit status
FAILED: Build did NOT complete successfully