27-Aug-2026 10:32:48: building syzkaller on 72524a6625c995608a7d179201dff2195b8d1f66... 27-Aug-2026 10:33:16: fetching kernel... 27-Aug-2026 10:33:25: checked out kernel commit 818bebeb63dd6bf5f4e07e145f6cdbace520a34c ("drm/xe: Don't hand out the flat CCS storage as usable VRAM", 2026-08-20 20:12:39 -0700 -0700) 27-Aug-2026 10:33:25: cleaning kernel... 27-Aug-2026 10:33:26: applying patch (834 bytes)... 27-Aug-2026 10:33:26: building kernel... 27-Aug-2026 10:41:55: kernel build failed: sound/core/control_led.c:117:50: error: expected ')' before 'return' sound/core/control_led.c:134:1: error: expected expression before '}' token sound/core/control_led.c:134:1: error: no return statement in function returning non-void [-Werror=return-type]